1-Dodecanamine
- Formula: C12H27N
- Molecular weight: 185.3495
- IUPAC Standard InChIKey: JRBPAEWTRLWTQC-UHFFFAOYSA-N
- CAS Registry Number: 124-22-1
- Chemical structure:
View 3d structure (requires JavaScript / HTML 5) - Other names: Dodecylamine; n-Dodecylamine; Alamine 4; Armeen 12D; Laurinamine; Laurylamine; Nissan Amine BB; 1-Aminododecane; Amine 12; Armeen 12; Lauramine; 1-Dodecylamine; Amine BB; Farmin 20D; Kemamine P690; Monododecylamine; n-Laurylamine

Phase change data

Data compiled as indicated in comments:
BS - Robert L. Brown and Stephen E. Stein
TRC - Thermodynamics Research Center, NIST Boulder Laboratories, Chris Muzny director
AC - William E. Acree, Jr., James S. Chickos
Quantity | Value | Units | Method | Reference | Comment |
---|---|---|---|---|---|
Tboil | 521.2 | K | N/A | Aldrich Chemical Company Inc., 1990 | BS |
Tboil | 532.2 | K | N/A | Weast and Grasselli, 1989 | BS |
Tboil | 405.65 | K | N/A | Harwood, 1938 | Uncertainty assigned by TRC = 5. K; TRC |
Tboil | 521.15 | K | N/A | Lutz, 1886 | Uncertainty assigned by TRC = 5. K; TRC |
Quantity | Value | Units | Method | Reference | Comment |
Tfus | 301. ± 2. | K | AVG | N/A | Average of 14 values; Individual data points |
Reduced pressure boiling point
Tboil (K) | Pressure (bar) | Reference | Comment |
---|---|---|---|
399.7 | 0.013 | Weast and Grasselli, 1989 | BS |
Enthalpy of vaporization
ΔvapH (kJ/mol) | Temperature (K) | Reference | Comment |
---|---|---|---|
63.4 | 371. | Stull, 1947 | Based on data from 356. to 521. K.; AC |
Antoine Equation Parameters
log10(P) = A − (B / (T + C))
P = vapor pressure (bar)
T = temperature (K)
View plot Requires a JavaScript / HTML 5 canvas capable browser.
Temperature (K) | A | B | C | Reference | Comment |
---|---|---|---|---|---|
356.0 to 521. | 5.73463 | 2821.24 | -28.629 | Stull, 1947 | Coefficents calculated by NIST from author's data. |

Reaction thermochemistry data

Data compiled by: Hussein Y. Afeefy, Joel F. Liebman, and Stephen E. Stein
Individual Reactions
By formula: C16H35NO2 = C12H27N + 2C2H4O
Quantity | Value | Units | Method | Reference | Comment |
---|---|---|---|---|---|
ΔrH° | -1004. ± 27. | kJ/mol | Eqk | Balcerowiak, Jerzykiewicz, et al., 1984 | solid phase |
By formula: C14H31NO = C12H27N + C2H4O
Quantity | Value | Units | Method | Reference | Comment |
---|---|---|---|---|---|
ΔrH° | -120.0 ± 4.6 | kJ/mol | Eqk | Balcerowiak, Jerzykiewicz, et al., 1984 | liquid phase |

Gas phase ion energetics data

Data compiled by: Michael M. Meot-Ner (Mautner)
Gas basicity at 298K
Gas basicity (review) (kJ/mol) | Reference | Comment |
---|---|---|
879.5 ± 9.2 | Gross, Rodriguez-Cruz, et al., 1995 | T = 300K; 3-Fluoropyridine; i-Propylamine. Reference GBs readjusted to Hunter and Lias, 1998. Cited uncertainty is half of the ΔGB between the bracketing bases |

Kovats' RI, non-polar column, isothermal

Column type | Active phase | Temperature (C) | I | Reference | Comment |
---|---|---|---|---|---|
Packed | PMS-100 | 180. | 1430. | Anderson, Jurel, et al., 1973 | He, Celite 545 (44-60 mesh); Column length: 3. m |

Kovats' RI, polar column, isothermal

Column type | Active phase | Temperature (C) | I | Reference | Comment |
---|---|---|---|---|---|
Packed | PEG-2000 | 152. | 1725. | Anderson, Jurel, et al., 1973 | He, Celite 545 (44-60 mesh); Column length: 3. m |
Packed | PEG-2000 | 179. | 1720. | Anderson, Jurel, et al., 1973 | He, Celite 545 (44-60 mesh); Column length: 3. m |
Packed | PEG-2000 | 200. | 1710. | Anderson, Jurel, et al., 1973 | He, Celite 545 (44-60 mesh); Column length: 3. m |

Van Den Dool and Kratz RI, non-polar column, temperature ramp

Column type | Active phase | I | Reference | Comment |
---|---|---|---|---|
Capillary | Ultra-1 | 1426. | Tokuda, Saitoh, et al., 1988 | 12.5 m/0.20 mm/0.11 μm, He, 5. K/min, 325. C @ 5. min; Tstart: 120. C |

Van Den Dool and Kratz RI, non-polar column, custom temperature program

Column type | Active phase | I | Reference | Comment |
---|---|---|---|---|
Capillary | DB-1 | 1442. | Peng, 2000 | 15. m/0.53 mm/1. μm, He; Program: 40C(3min) => 8C/min => 200(1min) => 5C/min => 300C(25min) |
Capillary | Methyl Silicone | 1444. | Peng, Yang, et al., 1991 | Program: not specified |
Packed | SE-30 | 1436. | Peng, Ding, et al., 1988 | Supelcoport; Chromosorb; Column length: 3.05 m; Program: 40C(5min) => 10C/min => 200C or 250C (60min) |

Van Den Dool and Kratz RI, polar column, temperature ramp

Column type | Active phase | I | Reference | Comment |
---|---|---|---|---|
Capillary | HP-Wax | 1724. | Peng, 2000 | 15. m/0.53 mm/1. μm, He, 40. C @ 3. min, 5. K/min, 220. C @ 30. min |

Normal alkane RI, non-polar column, temperature ramp

Column type | Active phase | I | Reference | Comment |
---|---|---|---|---|
Capillary | Ultra-1 | 1435. | Okumura, 1991 | 25. m/0.32 mm/0.25 μm, He, 3. K/min; Tstart: 80. C; Tend: 260. C |

Normal alkane RI, polar column, custom temperature program

Column type | Active phase | I | Reference | Comment |
---|---|---|---|---|
Capillary | DB-Wax | 1716. | Peng, Yang, et al., 1991, 2 | Program: not specified |

References

Aldrich Chemical Company Inc., 1990
Aldrich Chemical Company Inc.,
Catalog Handbook of Fine Chemicals, Aldrich Chemical Company, Inc., Milwaukee WI, 1990, 1. [all data]
Weast and Grasselli, 1989
CRC Handbook of Data on Organic Compounds, 2nd Editon, Weast,R.C and Grasselli, J.G., ed(s)., CRC Press, Inc., Boca Raton, FL, 1989, 1. [all data]
Harwood, 1938
Harwood, J.,
, 1938. [all data]
Lutz, 1886
Lutz, E.,
The Degradation of Myristic Acid to Lauric Acid,
Chem. Ber., 1886, 19, 1433. [all data]
Stull, 1947
Stull, Daniel R.,
Vapor Pressure of Pure Substances. Organic and Inorganic Compounds,
Ind. Eng. Chem., 1947, 39, 4, 517-540, https://doi.org/10.1021/ie50448a022
. [all data]
Balcerowiak, Jerzykiewicz, et al., 1984
Balcerowiak, W.; Jerzykiewicz, W.; Szewczyk, H.,
Differential thermal analysis using closed pans. The ethoxylation of n-dodecylamine,
Tenside Deterg., 1984, 21, 10-11. [all data]
Gross, Rodriguez-Cruz, et al., 1995
Gross, D.S.; Rodriguez-Cruz, S.E.; Bock, S.; Williams, E.R.,
Measurement of the Coulomb Energy and Dielectric Polarizability of Gas-Phase Diprotonated Diaminoalkanes,
J. Phys. Chem., 1995, 99, 4034. [all data]
Hunter and Lias, 1998
Hunter, E.P.; Lias, S.G.,
Evaluated Gas Phase Basicities and Proton Affinities of Molecules: An Update,
J. Phys. Chem. Ref. Data, 1998, 27, 3, 413-656, https://doi.org/10.1063/1.556018
. [all data]
Anderson, Jurel, et al., 1973
Anderson, A.; Jurel, S.; Shymanska, M.; Golender, L.,
Gas-liquid chromatography of some aliphatic and heterocyclic mono- and pollyfunctional amines. VII. Retention indices of amines in some polar and unpolar stationary phases,
Latv. PSR Zinat. Akad. Vestis Kim. Ser., 1973, 1, 51-63. [all data]
Tokuda, Saitoh, et al., 1988
Tokuda, H.; Saitoh, E.; Kimura, Y.; Takano, S.,
Automated analysis of various compounds with a wide range of boiling points by capillary gas chromatgraphy based on retention indices,
J. Chromatogr., 1988, 454, 109-120, https://doi.org/10.1016/S0021-9673(00)88606-9
. [all data]
Peng, 2000
Peng, C.T.,
Prediction of retention indices. V. Influence of electronic effects and column polarity on retention index,
J. Chromatogr. A, 2000, 903, 1-2, 117-143, https://doi.org/10.1016/S0021-9673(00)00901-8
. [all data]
Peng, Yang, et al., 1991
Peng, C.T.; Yang, Z.C.; Maltby, D.,
Prediction of retention indexes. III. Silylated derivatives of polar compounds,
J. Chromatogr., 1991, 586, 1, 113-129, https://doi.org/10.1016/0021-9673(91)80029-G
. [all data]
Peng, Ding, et al., 1988
Peng, C.T.; Ding, S.F.; Hua, R.L.; Yang, Z.C.,
Prediction of Retention Indexes I. Structure-Retention Index Relationship on Apolar Columns,
J. Chromatogr., 1988, 436, 137-172, https://doi.org/10.1016/S0021-9673(00)94575-8
. [all data]
Okumura, 1991
Okumura, T.,
retention indices of environmental chemicals on methyl silicone capillary column,
Journal of Environmental Chemistry (Japan), 1991, 1, 2, 333-358, https://doi.org/10.5985/jec.1.333
. [all data]
Peng, Yang, et al., 1991, 2
Peng, C.T.; Yang, Z.C.; Ding, S.F.,
Prediction of rentention idexes. II. Structure-retention index relationship on polar columns,
J. Chromatogr., 1991, 586, 1, 85-112, https://doi.org/10.1016/0021-9673(91)80028-F
. [all data]