Octanoic acid
- Formula: C8H16O2
- Molecular weight: 144.2114
- IUPAC Standard InChIKey: WWZKQHOCKIZLMA-UHFFFAOYSA-N
- CAS Registry Number: 124-07-2
- Chemical structure:
View 3d structure (requires JavaScript / HTML 5) - Other names: n-Caprylic acid; n-Octanoic acid; n-Octoic acid; n-Octylic acid; Neo-Fat 8; Caprylic acid; Enantic acid; Octylic acid; 1-Heptanecarboxylic acid; Heptane-1-carboxylic acid; Octic acid; Hexacid 898; C-8 Acid; Kyselina kaprylova; Lunac 8-95; Emery 657; Octoic acid; Prifac 2901; 1-Octanoic acid; NSC 5024; Prifrac 2901

Gas phase thermochemistry data

Data compiled by: Donald R. Burgess, Jr.
Quantity | Value | Units | Method | Reference | Comment |
---|---|---|---|---|---|
ΔfH°gas | -132.5 ± 0.31 | kcal/mol | Ccb | Adriaanse, Dekker, et al., 1965 | Value computed using ΔfHliquid° from Adriaanse, Dekker, et al., 1965 and ΔvapH° value of 19.2 kcal/mol from Baccanari, Novinski, et al., 1968. estimated uncertainty |
ΔfH°gas | -133.0 | kcal/mol | N/A | Lebedeva, 1964 | Value computed using ΔfHliquid° value of -636.89±0.54 kj/mol from Lebedeva, 1964 and ΔvapH° value of 80.3 kj/mol from missing citation. |
ΔfH°gas | -132.4 ± 0.26 | kcal/mol | N/A | Lebedeva, 1964 | Value computed using ΔfHliquid° value of -636.89±0.54 kj/mol from Lebedeva, 1964 and ΔvapH° value of 82.9±1 kj/mol from missing citation. |
ΔfH°gas | -133.0 ± 0.26 | kcal/mol | Ccb | Lebedeva, 1964 | Value computed using ΔfHliquid° from Lebedeva, 1964 and ΔvapH° value of 19.2 kcal/mol from Baccanari, Novinski, et al., 1968. estimated uncertainty |

Condensed phase thermochemistry data

Data compiled as indicated in comments:
DRB - Donald R. Burgess, Jr.
ALS - Hussein Y. Afeefy, Joel F. Liebman, and Stephen E. Stein
DH - Eugene S. Domalski and Elizabeth D. Hearing
Quantity | Value | Units | Method | Reference | Comment |
---|---|---|---|---|---|
ΔfH°liquid | -151.7 ± 0.2 | kcal/mol | Ccb | Adriaanse, Dekker, et al., 1965 | estimated uncertainty; DRB |
ΔfH°liquid | -152.22 ± 0.13 | kcal/mol | Ccb | Lebedeva, 1964 | ALS |
Quantity | Value | Units | Method | Reference | Comment |
ΔcH°liquid | -1147.2 ± 0.2 | kcal/mol | Ccb | Adriaanse, Dekker, et al., 1965 | Corresponding ΔfHºliquid = -151.7 kcal/mol (simple calculation by NIST; no Washburn corrections); ALS |
ΔcH°liquid | -1146.73 ± 0.13 | kcal/mol | Ccb | Lebedeva, 1964 | Corresponding ΔfHºliquid = -152.20 kcal/mol (simple calculation by NIST; no Washburn corrections); ALS |
Constant pressure heat capacity of liquid
Cp,liquid (cal/mol*K) | Temperature (K) | Reference | Comment |
---|---|---|---|
71.205 | 298.15 | Schaake, van Miltenburg, et al., 1982 | T = 80 to 300 K.; DH |
72.80 | 305. | Garner and Randall, 1924 | T = 0 to 46 C. Mean value 18 to 46 C.; DH |

Phase change data

Data compiled as indicated in comments:
BS - Robert L. Brown and Stephen E. Stein
TRC - Thermodynamics Research Center, NIST Boulder Laboratories, Chris Muzny director
AC - William E. Acree, Jr., James S. Chickos
ALS - Hussein Y. Afeefy, Joel F. Liebman, and Stephen E. Stein
DH - Eugene S. Domalski and Elizabeth D. Hearing
Quantity | Value | Units | Method | Reference | Comment |
---|---|---|---|---|---|
Tboil | 510. ± 4. | K | AVG | N/A | Average of 22 out of 24 values; Individual data points |
Quantity | Value | Units | Method | Reference | Comment |
Tfus | 289.3 ± 0.7 | K | AVG | N/A | Average of 6 values; Individual data points |
Quantity | Value | Units | Method | Reference | Comment |
Ttriple | 289.66 | K | N/A | Schaake, van Miltenburg, et al., 1982, 2 | Uncertainty assigned by TRC = 0.02 K; TRC |
Quantity | Value | Units | Method | Reference | Comment |
Tc | 693.0 | K | N/A | Andereya and Chase, 1990 | Uncertainty assigned by TRC = 1. K; TRC |
Tc | 694. | K | N/A | Ambrose and Ghiassee, 1987 | Uncertainty assigned by TRC = 1.5 K; TRC |
Tc | 697.2 | K | N/A | D'Souza and Teja, 1987 | Uncertainty assigned by TRC = 3. K; Ambrose's procedure; TRC |
Quantity | Value | Units | Method | Reference | Comment |
Pc | 28.31 | atm | N/A | Andereya and Chase, 1990 | Uncertainty assigned by TRC = 0.59 atm; TRC |
Pc | 26.65 | atm | N/A | Ambrose and Ghiassee, 1987 | Uncertainty assigned by TRC = 2.47 atm; TRC |
Pc | 25.3189 | atm | N/A | D'Souza and Teja, 1987 | Uncertainty assigned by TRC = 0.89 atm; Ambrose's procedure; TRC |
Quantity | Value | Units | Method | Reference | Comment |
ΔvapH° | 19.4 ± 0.1 | kcal/mol | GS | Verevkin, 2000 | Based on data from 297. to 434. K.; AC |
ΔvapH° | 19.4 | kcal/mol | CGC | Chickos, Hosseini, et al., 1995 | Based on data from 353. to 393. K.; AC |
ΔvapH° | 19.8 ± 0.24 | kcal/mol | V | Kruif and Oonk, 1979 | ALS |
ΔvapH° | 19.8 ± 0.24 | kcal/mol | TE | Kruif and Oonk, 1979 | Based on data from 291. to 303. K.; AC |
ΔvapH° | 19.2 | kcal/mol | V | Baccanari, Novinski, et al., 1968 | ALS |
Quantity | Value | Units | Method | Reference | Comment |
ΔsubH° | 27. ± 1. | kcal/mol | TPD | Cappa, Lovejoy, et al., 2008 | AC |
Enthalpy of vaporization
ΔvapH (kcal/mol) | Temperature (K) | Method | Reference | Comment |
---|---|---|---|---|
19.1 ± 0.1 | 320. | GS | Verevkin, 2000 | Based on data from 297. to 343. K.; AC |
15.9 | 432. | A,EB | Ambrose and Ghiassee, 1987, 2 | Based on data from 417. to 514. K.; AC |
20.4 | 311. | A | Stephenson and Malanowski, 1987 | Based on data from 296. to 331. K.; AC |
17.8 | 375. | A | Stephenson and Malanowski, 1987 | Based on data from 360. to 512. K.; AC |
19.1 | 290. | N/A | de Kruif, Schaake, et al., 1982 | AC |
16.7 | 407. | I | Cramer, 1943 | AC |
Antoine Equation Parameters
log10(P) = A − (B / (T + C))
P = vapor pressure (atm)
T = temperature (K)
View plot Requires a JavaScript / HTML 5 canvas capable browser.
Temperature (K) | A | B | C | Reference | Comment |
---|---|---|---|---|---|
403.3 to 479.5 | 4.24664 | 1530.446 | -150.12 | Rose, Acciarri, et al., 1957 | Coefficents calculated by NIST from author's data. |
Enthalpy of fusion
ΔfusH (kcal/mol) | Temperature (K) | Reference | Comment |
---|---|---|---|
5.1099 | 289.5 | Garner and Randall, 1924 | DH |
5.110 | 289.7 | Domalski and Hearing, 1996 | AC |
Entropy of fusion
ΔfusS (cal/mol*K) | Temperature (K) | Reference | Comment |
---|---|---|---|
17.7 | 289.5 | Garner and Randall, 1924 | DH |
Enthalpy of phase transition
ΔHtrs (kcal/mol) | Temperature (K) | Initial Phase | Final Phase | Reference | Comment |
---|---|---|---|---|---|
5.1028 | 289.66 | crystaline, I | liquid | Schaake, van Miltenburg, et al., 1982 | DH |
Entropy of phase transition
ΔStrs (cal/mol*K) | Temperature (K) | Initial Phase | Final Phase | Reference | Comment |
---|---|---|---|---|---|
17.62 | 289.66 | crystaline, I | liquid | Schaake, van Miltenburg, et al., 1982 | DH |

Normal alkane RI, polar column, temperature ramp

Data compiled by: NIST Mass Spectrometry Data Center, William E. Wallace, director

Column type CapillaryCapillaryCapillaryCapillaryCapillary
Active phase FFAPVF-Wax MSCP-WaxDB-WaxHP-20M
Column length (m) 60.60.60.30.50.
Carrier gas HeliumHeliumHeliumHeliumHelium
Substrate
Column diameter (mm) 0.250.250.250.250.25
Phase thickness (μm) 0.250.250.250.250.25
Tstart (C) 45.60.50.40.70.
Tend (C) 220.220.230.230.180.
Heat rate (K/min) 5.3.6.3.4.
Initial hold (min) 1.5.2.2.4.
Final hold (min) 5.25.15.5.
I 2039.2057.2050.2076.2086.
ReferencePiyachaiseth, Jirapakkul, et al., 2011Duarte, Dias, et al., 2010Mo, Fan, et al., 2009Zhao, Xu, et al., 2009Blazevic and Mastelic, 2008
Comment MSDC-RI MSDC-RI MSDC-RI MSDC-RI MSDC-RI
Column type CapillaryCapillaryCapillaryCapillaryCapillary
Active phase HP-20MCP-Wax 57 CBHP-InnowaxHP-InnowaxCP-Wax 52CB
Column length (m) 50.50.50.30.30.
Carrier gas HeliumHydrogenHeliumHeliumHe
Substrate
Column diameter (mm) 0.250.250.200.25
Phase thickness (μm) 0.250.200.200.250.32
Tstart (C) 70.35.45.50.50.
Tend (C) 180.150.190.250.220.
Heat rate (K/min) 4.4.4.6.56.
Initial hold (min) 4.5.2.1.52.
Final hold (min)  17.550.10.20.
I 2096.2098.2051.2050.2054.
ReferenceBlazevic and Mastelic, 2008Callejon, Morales, et al., 2008Soria, Sanz, et al., 2008Thakeow, Angeli, et al., 2008Audino, Alzogaray, et al., 2007
Comment MSDC-RI MSDC-RI MSDC-RI MSDC-RI MSDC-RI
Column type CapillaryCapillaryCapillaryCapillaryCapillary
Active phase StabilwaxCP-Wax 52CBCP-Wax 52CBRTX-WaxBP-20
Column length (m) 60.60.60.30.30.
Carrier gas HeliumHeHeHeHe
Substrate
Column diameter (mm) 0.250.320.320.250.25
Phase thickness (μm) 0.250.50.50.50.25
Tstart (C) 40.40.40.40.70.
Tend (C) 240.220.220.220.220.
Heat rate (K/min) 3.4.4.10.4.
Initial hold (min) 5.8.8.5.4.
Final hold (min) 10.20.20.10.5.
I 2068.2069.2067.2042.2075.
ReferenceCros, Vandanjon, et al., 2007Povolo, Contarini, et al., 2007Povolo, Contarini, et al., 2007Prososki, Etzel, et al., 2007Rawat, Gulati, et al., 2007
Comment MSDC-RI MSDC-RI MSDC-RI MSDC-RI MSDC-RI
Column type CapillaryCapillaryCapillaryCapillaryCapillary
Active phase DB-WaxDB-WaxDB-WaxDB-WaxDB-Wax
Column length (m) 30.30.60.60.30.
Carrier gas HeHeHeN2He
Substrate
Column diameter (mm) 0.250.250.250.250.32
Phase thickness (μm) 0.250.250.250.250.25
Tstart (C) 40.40.70.70.40.
Tend (C) 230.230.230.230.230.
Heat rate (K/min) 4.4.2.2.4.
Initial hold (min) 2.2.2.2.2.
Final hold (min) 5.5.20.20.15.
I 2060.2060.2083.2050.2060.
ReferenceXu, Fan, et al., 2007Xu, Fan, et al., 2007Choi H.S., 2006Choi, 2006Fan and Qian, 2006
Comment MSDC-RI MSDC-RI MSDC-RI MSDC-RI MSDC-RI
Column type CapillaryCapillaryCapillaryCapillaryCapillary
Active phase DB-WaxDB-Wax EtrDB-WaxDB-Wax EtrDB-Wax
Column length (m) 30.60.15.30.60.
Carrier gas N2HeHeHe
Substrate
Column diameter (mm) 0.320.250.320.250.25
Phase thickness (μm) 0.250.250.250.250.25
Tstart (C) 40.40.40.40.70.
Tend (C) 230.230.230.220.230.
Heat rate (K/min) 6.2.6.2.2.
Initial hold (min) 2.5. 1.2.
Final hold (min) 15.100.20.10.20.
I 2091.2104.2049.2059.2084.
ReferenceFan and Qian, 2006, 2Ibarz, Ferreira, et al., 2006Kishimoto, Wanikawa, et al., 2006Perestrelo, Fernandes, et al., 2006Sawamura, Onishi, et al., 2006
Comment MSDC-RI MSDC-RI MSDC-RI MSDC-RI MSDC-RI
Column type CapillaryCapillaryCapillaryCapillaryCapillary
Active phase ZB-WaxCarbowax 20MDB-WaxDB-WaxZB-Wax
Column length (m) 60.50.30.60.30.
Carrier gas HeHeliumHeNitrogenHelium
Substrate
Column diameter (mm) 0.320.250.250.320.32
Phase thickness (μm) 0.50.250.250.500.25
Tstart (C) 40.40.50.35.40.
Tend (C) 250.190.180.235.250.
Heat rate (K/min) 3.4.3.2.5.
Initial hold (min) 2.2. 4.2.
Final hold (min) 10.30.40.30.5.
I 2079.2047.2056.2085.2062.
ReferenceWierda R.L., Fletcher G., et al., 2006de la Fuente, Martinez-Castro, et al., 2005Lee, Umano, et al., 2005Qian and Wang, 2005N/A
Comment MSDC-RI MSDC-RI MSDC-RI MSDC-RI MSDC-RI
Column type CapillaryCapillaryCapillaryCapillaryCapillary
Active phase ZB-WaxZB-WaxDB-WaxDB-WaxDB-Wax
Column length (m) 30.30.60.60.30.
Carrier gas HeliumHeliumN2N2H2
Substrate
Column diameter (mm) 0.320.320.250.250.32
Phase thickness (μm) 0.250.250.250.250.5
Tstart (C) 40.40.70.70.40.
Tend (C) 250.250.230.230.200.
Heat rate (K/min) 5.5.2.2.4.
Initial hold (min) 2.2.2.2.5.
Final hold (min) 5.5.20.20.
I 2070.2070.2076.2070.2098.
ReferenceN/AN/AChoi, 2004Choi, 2004, 2Culleré, Escudero, et al., 2004
Comment MSDC-RI MSDC-RI MSDC-RI MSDC-RI MSDC-RI
Column type CapillaryCapillaryCapillaryCapillaryCapillary
Active phase DB-WaxDB-WaxHP-InnowaxStabilwaxDB-Wax
Column length (m) 60.60.50.60.60.
Carrier gas HeHeHeHeliumH2
Substrate
Column diameter (mm) 0.250.250.20.250.32
Phase thickness (μm)  0.250.20.250.25
Tstart (C) 60.40.45.40.40.
Tend (C) 220.220.190.240.230.
Heat rate (K/min) 2.3.4.3.4.
Initial hold (min) 4.5.2.5.5.
Final hold (min)   50.10.25.
I 2060.2075.2089.2068.2056.
ReferenceJiang and Kubota, 2004López, Ezpeleta, et al., 2004Soria, Gonzalez, et al., 2004Cros, Vandanjon, et al., 2003Dregus and Engel, 2003
Comment MSDC-RI MSDC-RI MSDC-RI MSDC-RI MSDC-RI
Column type CapillaryCapillaryCapillaryCapillaryCapillary
Active phase DB-WaxDB-WaxDB-WaxTC-WaxDB-Wax
Column length (m) 30.30.30.60.30.
Carrier gas HeHeH2He
Substrate
Column diameter (mm) 0.250.250.320.250.25
Phase thickness (μm) 0.250.250.5 0.25
Tstart (C) 40.50.40.80.30.
Tend (C) 185.230.200.250.250.
Heat rate (K/min) 4.3.4.4.4.
Initial hold (min) 4.2.5. 1.
Final hold (min) 20.20. 30.
I 2058.2063.2097.2054.2064.
ReferenceLee and Noble, 2003Lin, Cai, et al., 2003López, Ortín, et al., 2003Miyazawa and Okuno, 2003Tanaka, Yamauchi, et al., 2003
Comment MSDC-RI MSDC-RI MSDC-RI MSDC-RI MSDC-RI
Column type CapillaryCapillaryCapillaryCapillaryCapillary
Active phase DB-WaxDB-FFAPDB-WaxDB-WaxTC-Wax
Column length (m) 30.30.30.60.60.
Carrier gas  HeH2 He
Substrate
Column diameter (mm) 0.250.320.320.250.25
Phase thickness (μm) 0.250.250.5 0.25
Tstart (C) 30.40.40.60.40.
Tend (C) 250.230.200.180.230.
Heat rate (K/min) 4.6.4.3.3.
Initial hold (min) 1.2.5.4.10.
Final hold (min)  10.  10.
I 2065.2046.2089.2096.2048.
ReferenceTanaka, Yamauchi, et al., 2003Czerny and Schieberle, 2002Ferreira, Ortín, et al., 2002Ito, Sugimoto, et al., 2002Suhardi, Suzuki, et al., 2002
Comment MSDC-RI MSDC-RI MSDC-RI MSDC-RI MSDC-RI
Column type CapillaryCapillaryCapillaryCapillaryCapillary
Active phase DB-WaxDB-WaxDB-WaxTC-WaxDB-FFAP
Column length (m) 60.30.30.60.30.
Carrier gas HeH2H2HeHe
Substrate
Column diameter (mm) 0.250.320.320.250.32
Phase thickness (μm) 0.250.50.5 0.25
Tstart (C) 40.40.40.80.40.
Tend (C) 200.200.200.250.195.
Heat rate (K/min) 2.4.4.4.5.
Initial hold (min) 2.5.5. 5.
Final hold (min)  60.60.47.40.
I 2047.2083.2083.2062.2044.
ReferenceUmano, Hagi, et al., 2002Aznar, López, et al., 2001Ferreira, Aznar, et al., 2001Miyazawa, Kurose, et al., 2001Suriyaphan, Drake, et al., 2001
Comment MSDC-RI MSDC-RI MSDC-RI MSDC-RI MSDC-RI
Column type CapillaryCapillaryCapillaryCapillaryCapillary
Active phase DB-WaxDB-WaxDB-WaxDB-WaxDB-Wax
Column length (m) 30.60.60.25.25.
Carrier gas HeHe HeHe
Substrate
Column diameter (mm) 0.250.250.250.250.25
Phase thickness (μm) 0.250.250.250.250.25
Tstart (C) 50.40.30.50.50.
Tend (C) 220.200.170.200.200.
Heat rate (K/min) 4.2.2.4.4.
Initial hold (min) 3. 4.4.4.
Final hold (min)   30.10.10.
I 2011.2047.2050.2047.2051.
ReferenceWeckerle, Bastl-Borrmann, et al., 2001Wei, Mura, et al., 2001Buttery, Light, et al., 2000Morales, Duque, et al., 2000Morales, Duque, et al., 2000
Comment MSDC-RI MSDC-RI MSDC-RI MSDC-RI MSDC-RI
Column type CapillaryCapillaryCapillaryCapillaryCapillary
Active phase DB-WaxDB-WaxDB-WaxDB-WaxDB-Wax
Column length (m) 30.30.60.30.30.
Carrier gas HeHeNitrogen
Substrate
Column diameter (mm) 0.250.250.250.530.53
Phase thickness (μm) 0.250.25
Tstart (C) 50.50.40.60.60.
Tend (C) 240.240.200.210.210.
Heat rate (K/min) 4.4.2.4.4.
Initial hold (min) 3.3.10.
Final hold (min) 10.10.
I 2035.2050.2067.2037.2037.
ReferenceParada, Duque, et al., 2000Parada, Duque, et al., 2000Tamura, Boonbumrung, et al., 2000Iwatsuki, Mizota, et al., 1999Iwatsuki, Mizota, et al., 1999
Comment MSDC-RI MSDC-RI MSDC-RI MSDC-RI MSDC-RI
Column type CapillaryCapillaryCapillaryCapillaryCapillary
Active phase HP Innowax FSPInnowaxHP-InnowaxHP-InnowaxCarbowax 20M
Column length (m) 60.60.60.60.60.
Carrier gas HeHeHeHeHe
Substrate
Column diameter (mm) 0.250.250.250.250.32
Phase thickness (μm) 0.250.250.250.250.5
Tstart (C) 60.60.60.60.40.
Tend (C) 220.220.220.220.190.
Heat rate (K/min)     2.
Initial hold (min) 10.10.10.10.5.
Final hold (min) 10.
I 2084.2084.2084.2084.2060.
ReferenceKaya, Baser, et al., 1999Kaya, Baser, et al., 1999, 2Kaya, Baser, et al., 1999, 3Kaya, Baser, et al., 1999, 3Lopez, Ferreira, et al., 1999
Comment MSDC-RI MSDC-RI MSDC-RI MSDC-RI MSDC-RI
Column type CapillaryCapillaryCapillaryCapillaryCapillary
Active phase DB-WaxDB-WaxSupelcowax-10Carbowax 20MHP-Innowax
Column length (m) 30.60.60.60.25.
Carrier gas HeliumHeH2He
Substrate
Column diameter (mm) 0.330.250.320.320.32
Phase thickness (μm) 0.250.250.50.5
Tstart (C) 40.40.35.40.35.
Tend (C) 200.200.250.190.250.
Heat rate (K/min) 6.2.5.2.4.
Initial hold (min) 5.2.5.5.
Final hold (min) 30. 20.
I 2060.2065.2062.2050.2040.
ReferenceSuriyaphan, Drake, et al., 1999Umano, Nakahara, et al., 1999Campeanu, Burcea, et al., 1998Ferreira, Ardanuy, et al., 1998Ong, Acree, et al., 1998
Comment MSDC-RI MSDC-RI MSDC-RI MSDC-RI MSDC-RI
Column type CapillaryCapillaryCapillaryCapillaryCapillary
Active phase DB-WaxDB-WaxPEG-20MDB-WaxHP-Innowax
Column length (m) 30.30.60.60.60.
Carrier gas HeHeHeHeH2
Substrate
Column diameter (mm) 0.250.250.250.250.32
Phase thickness (μm) 0.250.25  0.5
Tstart (C) 50.50.70.60.50.
Tend (C) 240.240.210.180.180.
Heat rate (K/min) 4.4.3.2.1.5
Initial hold (min) 3.3.
Final hold (min) 10.10.
I 2023.2055.2040.2059.2063.
ReferenceParada and Duque, 1998Parada and Duque, 1998Awano, Honda, et al., 1997Sekiwa, Kubota, et al., 1997Ulrich, Hoberg, et al., 1997
Comment MSDC-RI MSDC-RI MSDC-RI MSDC-RI MSDC-RI
Column type CapillaryCapillaryCapillaryCapillaryCapillary
Active phase DB-WaxPEG-20MDB-WaxDB-WaxTC-Wax
Column length (m) 60.50.30.30.60.
Carrier gas HeNitrogenHeHe
Substrate
Column diameter (mm) 0.250.250.250.250.25
Phase thickness (μm)  0.250.250.25
Tstart (C) 50.60.20.50.80.
Tend (C) 200.180.200.200.240.
Heat rate (K/min) 3.2.4.4.3.
Initial hold (min)   4.4.5.
Final hold (min) 40. 10.10.
I 2072.2022.2071.2075.2073.
ReferenceWada and Shibamoto, 1997Kubota, Matsujage, et al., 1996Morales, Albarracín, et al., 1996Morales, Albarracín, et al., 1996Shuichi, Masazumi, et al., 1996
Comment MSDC-RI MSDC-RI MSDC-RI MSDC-RI MSDC-RI
Column type CapillaryCapillaryCapillaryCapillaryCapillary
Active phase Carbowax 20MCarbowax 20MPEG-20MPEG-20MDB-Wax
Column length (m) 60.60.50.50.60.
Carrier gas   HeHe
Substrate
Column diameter (mm) 0.250.250.250.250.25
Phase thickness (μm)   0.150.15
Tstart (C) 60.60.60.60.60.
Tend (C) 180.180.180.180.220.
Heat rate (K/min) 2.2.2.2.3.
Initial hold (min) 4.4.4.4.4.
Final hold (min)
I 2096.2013.2014.2017.2085.
ReferenceKawakami, Ganguly, et al., 1995Kawakami, Ganguly, et al., 1995Togari, Kobayashi, et al., 1995Togari, Kobayashi, et al., 1995Chung, Eiserich, et al., 1993
Comment MSDC-RI MSDC-RI MSDC-RI MSDC-RI MSDC-RI
Column type CapillaryCapillaryCapillaryCapillaryCapillary
Active phase Carbowax 20MCarbowax 20MDB-WaxDB-WaxCarbowax 20M
Column length (m) 50.50.60.30.50.
Carrier gas HeHeHeHeHe
Substrate
Column diameter (mm) 0.250.250.250.250.25
Phase thickness (μm)   0.25
Tstart (C) 60.60.50.60.60.
Tend (C) 180.180.230.240.180.
Heat rate (K/min) 2.2.2.3.2.
Initial hold (min) 4.4.4.10.4.
Final hold (min)
I 2096.2013.2053.2031.2096.
ReferenceKawakami, Kobayashi, et al., 1993Kawakami, Kobayashi, et al., 1993Shimoda, Shiratsuchi, et al., 1993Hatsuko, Kazuko, et al., 1992Kawakami and Kobayashi, 1991
Comment MSDC-RI MSDC-RI MSDC-RI MSDC-RI MSDC-RI
Column type CapillaryCapillaryCapillaryCapillaryCapillary
Active phase Carbowax 20MSP-1000Carbowax 20MDB-WaxCarbowax 20M
Column length (m) 50.25.50.30.50.
Carrier gas HeN2N2HeliumN2
Substrate
Column diameter (mm) 0.250.20.220.320.22
Phase thickness (μm)  0.43
Tstart (C) 60.60.80.40.80.
Tend (C) 180.190.200.200.200.
Heat rate (K/min) 2.4.3.6.3.
Initial hold (min) 4.  1.
Final hold (min)  30.
I 2013.2061.2011.2072.2011.
ReferenceKawakami and Kobayashi, 1991De Llano D.G., Ramos M., et al., 1990Mihara, Tateba, et al., 1988Andersen J.F., Mikolajczak K.L., et al., 1987Mihara, Tateba, et al., 1987
Comment MSDC-RI MSDC-RI MSDC-RI MSDC-RI MSDC-RI
Column type Capillary
Active phase Carbowax 20M
Column length (m) 150.
Carrier gas
Substrate
Column diameter (mm) 0.64
Phase thickness (μm)
Tstart (C) 50.
Tend (C) 170.
Heat rate (K/min) 1.
Initial hold (min) 30.
Final hold (min)
I 2100.
ReferenceButtery, Parker, et al., 1981
Comment MSDC-RI

Normal alkane RI, non-polar column, custom temperature program

Data compiled by: NIST Mass Spectrometry Data Center, William E. Wallace, director

Column type CapillaryCapillaryCapillaryCapillaryCapillary
Active phase Siloxane, 5 % PhVF-5 MSDB-5HP-5 MSPolydimethyl siloxane, 5 % phenyl
Column length (m)  30.60.30.
Carrier gas  HeliumHeliumHelium
Substrate
Column diameter (mm)  0.250.250.25
Phase thickness (μm)  0.251.000.25
Program not specifiednot specified40 0C 4 0C/min -> 230 0C 100 0C/min -> 260 0C (11.7 min)40 0C (10 min) 3 0C/min -> 200 0C 2 0C/min -> 220 0Cnot specified
I 1157.1180.1152.1172.1157.
ReferenceVOC BinBase, 2012Liu, Lu, et al., 2011Miyazaki, Plotto, et al., 2011Nance and Setzer, 2011Skogerson, Wohlgemuth, et al., 2011
Comment MSDC-RI MSDC-RI MSDC-RI MSDC-RI MSDC-RI
Column type CapillaryCapillaryCapillaryCapillaryCapillary
Active phase ZB-1 MSHP-5 MSZB-1 MSDB-1HP-5
Column length (m) 30.30.30.60.50.
Carrier gas HeliumHeliumHeliumHeliumHelium
Substrate
Column diameter (mm) 0.250.320.250.250.32
Phase thickness (μm) 0.250.250.250.251.05
Program 50 0C 3 0C/min -> 150 0C (10 min) 10 0C/min -> 250 0Cnot specified50 0C 3 0C/min -> 150 0C (10 min) 10 0C/min -> 250 0C50 0C (5 min) 3 0C/min -> 120 0C 5 0C/min -> 250 0C (3 min) 15 0C/min -> 300 0C (20 min)not specified
I 1173.1181.1173.1147.1175.
ReferenceAl-Reza, Rahman, et al., 2010Pino, Marquez, et al., 2010Bajpai, Al-Reza, et al., 2009Delort and Jaquier, 2009Pugliese, Sirtori, et al., 2009
Comment MSDC-RI MSDC-RI MSDC-RI MSDC-RI MSDC-RI
Column type CapillaryCapillaryCapillaryCapillaryCapillary
Active phase HP-5HP-5 MSDB-5 MSHP-5HP-5
Column length (m) 50.30.30.30.30.
Carrier gas HeliumHeliumHelium
Substrate
Column diameter (mm) 0.320.250.320.250.25
Phase thickness (μm) 1.050.251.00.250.25
Program 40 0C (10 min) 5 0C/min -> 200 0C 15 0C/min -> 250 0C (10 min)50 0C (2 min) 20 0C/min -> 80 0C (1 min) 20 0C -> 100 0C (1 min) 30 0C/min -> 230 0C (2 min)-10 0C (3 min) 50 0C/min -> 40 0C 5 0C/min -> 290 0C (5 min)40 0C (2 min) 5 0C/min -> 80 0C 7 oC/min -> 160 0C 9 0C/min -> 200 0C 20 0C/min -> 280 0C (10 min)not specified
I 1166.1174.1170.1201.1188.
ReferenceVentanas, Estevez, et al., 2008Wan Aida, Ho, et al., 2008Watanabe, Ueda, et al., 2008Zhao, Li, et al., 2008Zhao, Li, et al., 2008
Comment MSDC-RI MSDC-RI MSDC-RI MSDC-RI MSDC-RI
Column type CapillaryCapillaryCapillaryCapillaryCapillary
Active phase SPB-1HP-5DB-5 MSHP-5BP-5
Column length (m) 30. 60.26.30.
Carrier gas He HeliumHeHe
Substrate
Column diameter (mm) 0.25 0.320.20.25
Phase thickness (μm) 0.25 1.00.251.
Program 40C(10min) => 2C/min => 200C(1min) => 2C/min => 250C (10min)not specified40 0C (2 min) 6 0C/min -> 100 0C 4 0C/min -> 180 0C 8 0C/min -> 250 0C (12 min)60C(5min) => 6C/min => 200C => 15C/min => 250C(5min)40C(2min) => 4C/min => 150C => 8C/min => 250C (15min)
I 1164.1189.1161.1180.1164.
ReferenceBosch-Fuste, Riu-Aumatell, et al., 2007Liolios, Laouer, et al., 2007Liu, Xu, et al., 2007Baroni, Nores, et al., 2006Helsper, Bücking, et al., 2006
Comment MSDC-RI MSDC-RI MSDC-RI MSDC-RI MSDC-RI
Column type CapillaryCapillaryCapillaryCapillaryCapillary
Active phase DB-5MFE-73HP-5DB-5SE-30
Column length (m) 30. 50.50.
Carrier gas He
Substrate
Column diameter (mm) 0.25 0.320.32
Phase thickness (μm) 0.25 1.051.05
Program 40C(1min) => 9C/min => 130C => 2C/min => 230Cnot specified40C(10min) => 5C/min => 200C => 20C/min => 250C(5min)40C(10min) => 5C/min => 200C => 20C/min => 250C (5min)not specified
I 1197.1200.1161.1161.1200.
ReferenceHamm, Bleton, et al., 2005Escudero, Gogorza, et al., 2004Garcia-Estaban, Ansorena, et al., 2004Garcia-Estaban, Ansorena, et al., 2004, 2Vinogradov, 2004
Comment MSDC-RI MSDC-RI MSDC-RI MSDC-RI MSDC-RI
Column type CapillaryCapillaryCapillaryCapillaryCapillary
Active phase DB-1HP-5HP-5HP-5MSMFE-73
Column length (m) 30.30.30.30.
Carrier gas H2He HeH2
Substrate
Column diameter (mm) 0.250.250.250.25
Phase thickness (μm) 0.250.250.250.25
Program 40C(10min) => 2C/min => 110C => 5C/min => 200C(10min)40C(1min) => 5C/min => 180C => 10C/min => 220C(2min)40C(6min) => 2.5C/min => 150C => 90C/min => 250C40C(1min) => 5C/min => 220C => 10C/min => 240C(2min)not specified
I 1180.1175.1179.1175.1200.
ReferenceAlves and Franco, 2003Demyttenaere, Dagher, et al., 2003Jordán, Margaría, et al., 2003Demyttenaere, Dagher, et al., 2002Ferreira, Ortín, et al., 2002
Comment MSDC-RI MSDC-RI MSDC-RI MSDC-RI MSDC-RI
Column type CapillaryCapillaryCapillaryCapillaryCapillary
Active phase HP-5HP-5HP-5MSMFE-73MFE-73
Column length (m) 30.30.30.30.30.
Carrier gas   HeH2H2
Substrate
Column diameter (mm) 0.250.250.250.320.32
Phase thickness (μm) 0.250.250.250.10.1
Program not specified40C (6min) => 2.5C/min => 150C => 90C/min => 250C40C (10min) => 3C/min => 120C => 10C/min => 250C (5min)40C(5min) => 2C/min => 120C => 10C/min => 210C(30min)40 C (5min) => 2C/min => 120C => 10 C/min => 210 C (30min)
I 1179.1179.1190.1200.1200.
ReferenceJordán, Goodner, et al., 2002Jordán, Margaría, et al., 2002Ansorena, Gimeno, et al., 2001Aznar, López, et al., 2001Ferreira, Aznar, et al., 2001
Comment MSDC-RI MSDC-RI MSDC-RI MSDC-RI MSDC-RI
Column type CapillaryCapillaryCapillaryCapillaryCapillary
Active phase HP-1HP-5CP Sil 5 CBCP Sil 5 CBHP-5
Column length (m) 50.30.50.50.50.
Carrier gas N2HeHeHeHe
Substrate
Column diameter (mm) 0.320.250.320.320.32
Phase thickness (μm) 0.520.25 1.20.52
Program 40C => 2C/min => 130C => 4C/min => 250C40C (10min) => 3C/min => 120C => 10C/min => 250C (5min)30C => 55C/min => 85C => 1C/min => 145C => 3C/min => 250C30C => 55C/min => 85C => 1C/min => 145C => 3C/min => 250C35 0C 10 0C/min -> 200 0C (20 min) 5 0C/min -> 230 0C (50 min)
I 1180.1188.1157.1153.1172.
ReferenceTeai, Claude-Lafontaine, et al., 2001Ansorena, Astiasarán, et al., 2000Guyot, Scheirman, et al., 1999Guyot, Bouseta, et al., 1998Timón, Ventanas, et al., 1998
Comment MSDC-RI MSDC-RI MSDC-RI MSDC-RI MSDC-RI
Column type CapillaryCapillaryCapillaryCapillaryCapillary
Active phase RSL-150DB-1DB-1SE-54SE-54
Column length (m) 60.60.60.50.50.
Carrier gas He  He
Substrate
Column diameter (mm) 0.320.320.320.320.32
Phase thickness (μm) 0.250.250.25
Program 30c (1.5min) => 20C/min => 55C => 6C/min => 200C(10min)not specified3 min at 5 C; 5 - 50 C at 3 deg/min; 50 - 220 C at 5 deg/min35 0C (5 min) 8 0C/min -> 200 0C 2 0C/min -> 250 0C35C(5min) => 8C/min => 200C => 2C/min => 250C
I 1158.1175.1175.1180.1170.
ReferenceBuchbauer, Nikiforov, et al., 1994Ciccioli, Cecinato, et al., 1994Ciccioli, Brancaleoni, et al., 1993Um, Bailey, et al., 1992Suzuki and Bailey, 1985
Comment MSDC-RI MSDC-RI MSDC-RI MSDC-RI MSDC-RI

Kovats' RI, non-polar column, temperature ramp

Data compiled by: NIST Mass Spectrometry Data Center, William E. Wallace, director

Column type CapillaryCapillaryCapillaryCapillary
Active phase CP Sil 8 CBDB-1DB-1BP-1
Column length (m) 30.60.60.50.
Carrier gas H2  He
Substrate
Column diameter (mm) 0.250.250.25
Phase thickness (μm) 0.250.250.25
Tstart (C) 50.30.30.-100.
Tend (C) 220.220.220.200.
Heat rate (K/min) 3.2.2.2.
Initial hold (min) 2.4.4.
Final hold (min)
I 1175.1165.1194.1197.
ReferenceSchwob, Bessiere, et al., 2004Takeoka, Perrino, et al., 1996Takeoka, Perrino, et al., 1996Bartley, 1988
Comment MSDC-RI MSDC-RI MSDC-RI MSDC-RI

Kovats' RI, polar column, temperature ramp

Data compiled by: NIST Mass Spectrometry Data Center, William E. Wallace, director

Column type Capillary
Active phase DB-Wax
Column length (m) 60.
Carrier gas He
Substrate
Column diameter (mm) 0.25
Phase thickness (μm) 0.25
Tstart (C) 40.
Tend (C) 200.
Heat rate (K/min) 3.
Initial hold (min) 5.
Final hold (min)
I 2070.
ReferenceTatsuka, Suekane, et al., 1990
Comment MSDC-RI

Van Den Dool and Kratz RI, polar column, temperature ramp

Data compiled by: NIST Mass Spectrometry Data Center, William E. Wallace, director

Column type CapillaryCapillaryCapillaryCapillaryCapillary
Active phase DB-FFAPDB-FFAPFFAPDB-WaxHP-Innowax
Column length (m) 30.30.30.30.60.
Carrier gas HeHeHeHeHe
Substrate
Column diameter (mm) 0.250.250.250.250.25
Phase thickness (μm) 0.50.50.250.50.25
Tstart (C) 35.35.35.40.50.
Tend (C) 225.225.225.250.220.
Heat rate (K/min) 4.4.10.4.4.
Initial hold (min) 5.5.5.5.4.
Final hold (min) 30.30.25.15.10.
I 2046.2055.2028.2067.2039.
ReferenceJarunrattanasri, Theerakulkait, et al., 2007Jarunrattanasri, Theerakulkait, et al., 2007Lozano P.R., Drake M., et al., 2007Pozo-Bayon M.A., Ruiz-Rodriguez A., et al., 2007Quijano, Linares, et al., 2007
Comment MSDC-RI MSDC-RI MSDC-RI MSDC-RI MSDC-RI
Column type CapillaryCapillaryCapillaryCapillaryCapillary
Active phase FFAPZB-WaxDB-WaxDB-WaxDB-Wax
Column length (m) 30.30.60.60.30.
Carrier gas HeHeHeHeHe
Substrate
Column diameter (mm) 0.320.320.250.250.32
Phase thickness (μm)  0.250.250.250.5
Tstart (C) 40.40.40.40.40.
Tend (C) 240.250.200.265.265.
Heat rate (K/min) 8.5.4.7.7.
Initial hold (min) 2.2.1.
Final hold (min) 5.5.10.5.5.
I 2050.2070.2072.2086.2089.
ReferenceSchlutt B., Moran N., et al., 2007Wu, Zorn, et al., 2007Cho, Choi, et al., 2006Gurbuz O., Rouseff J.M., et al., 2006Gurbuz O., Rouseff J.M., et al., 2006
Comment MSDC-RI MSDC-RI MSDC-RI MSDC-RI MSDC-RI
Column type CapillaryCapillaryCapillaryCapillaryCapillary
Active phase InnowaxDB-WaxLM-120DB-FFAPOV-351
Column length (m) 60.30.50.30.50.
Carrier gas HeHe H2He
Substrate
Column diameter (mm) 0.250.250.250.250.32
Phase thickness (μm) 0.250.250.50.250.2
Tstart (C) 40.50.50.30.60.
Tend (C) 230.220.240.230.220.
Heat rate (K/min) 4.4.3.3.5.
Initial hold (min) 4.4. 2.
Final hold (min) 20.20.30.4.
I 2060.2038.2024.2068.2013.
ReferenceLee, Lee, et al., 2006Osorio, Alarcon, et al., 2006Pinto, Guedes, et al., 2006Schwambach and Peterson, 2006Bonvehí, 2005
Comment MSDC-RI MSDC-RI MSDC-RI MSDC-RI MSDC-RI
Column type CapillaryCapillaryCapillaryCapillaryCapillary
Active phase DB-WaxDB-WaxDB-FFAPStabilwaxStabilwax
Column length (m) 30.60.30.60.30.
Carrier gas  N2N2HeN2
Substrate
Column diameter (mm) 0.250.250.250.250.32
Phase thickness (μm) 0.250.250.250.251.
Tstart (C) 40.70.40.40.40.
Tend (C) 200.230.230.240.230.
Heat rate (K/min) 10.2.5.3.4.
Initial hold (min) 3.2.2.5.2.
Final hold (min) 20.20.6.10.10.
I 2051.2084.2052.2068.2083.
ReferenceCarunchia Whetstine, Croissant, et al., 2005Choi, 2005Colahan-Sederstrom and Peterson, 2005Cros, Lignot, et al., 2005Fang and Qian, 2005
Comment MSDC-RI MSDC-RI MSDC-RI MSDC-RI MSDC-RI
Column type CapillaryCapillaryCapillaryCapillaryCapillary
Active phase DB-WaxSupelcowax-10Carbowax 20MDB-WaxZB-Wax
Column length (m) 60.30.60.30.30.
Carrier gas HeHeHe He
Substrate
Column diameter (mm) 0.320.250.250.250.25
Phase thickness (μm) 1.0.250.250.250.15
Tstart (C) 45.60.45.40.35.
Tend (C) 250.240.250.200.220.
Heat rate (K/min) 5.3.2.10.1.8
Initial hold (min) 1.5.0.175.10.
Final hold (min) 12.10. 15.10.
I 2052.2068.2022.2030.2069.
ReferenceMalliaa, Fernandez-Garcia, et al., 2005Riu-Aumatell, Lopez-Tamames, et al., 2005Verzera, Campisi, et al., 2005Avsar, Karagul-Yuceer, et al., 2004Ledauphin, Saint-Clair, et al., 2004
Comment MSDC-RI MSDC-RI MSDC-RI MSDC-RI MSDC-RI
Column type CapillaryCapillaryCapillaryCapillaryCapillary
Active phase DB-WaxDB-Wax EtrDB-WaxDB-WaxDB-Wax
Column length (m) 30.30.30.60.60.
Carrier gas HeHeHeN2He
Substrate
Column diameter (mm) 0.250.250.250.250.25
Phase thickness (μm) 0.50.250.250.250.25
Tstart (C) 40.40.40.70.40.
Tend (C) 230.245.250.230.210.
Heat rate (K/min) 5.3.3.2.2.
Initial hold (min) 2.3. 2.
Final hold (min) 10.20.20.20.40.
I 2072.2046.2034.2083.2045.
ReferenceMahajan, Goddik, et al., 2004Ménager, Jost, et al., 2004Brat, Rega, et al., 2003Choi, 2003Chyau, Ko, et al., 2003
Comment MSDC-RI MSDC-RI MSDC-RI MSDC-RI MSDC-RI
Column type CapillaryCapillaryCapillaryCapillaryCapillary
Active phase StabilwaxDB-FFAPAT-WaxDB-WaxDB-Wax
Column length (m) 60.30.60.30.60.
Carrier gas HeHeHe N2
Substrate
Column diameter (mm) 0.250.250.320.320.25
Phase thickness (μm) 0.250.250.250.50.25
Tstart (C) 40.35.65.35.70.
Tend (C) 240.200.250.240.230.
Heat rate (K/min) 3.10.2.5.2.
Initial hold (min) 5.5.10.5.
Final hold (min) 10.30.60.5.20.
I 2068.2054.2034.2091.2082.
ReferenceCros, Vandanjon, et al., 2003Karagül-Yüceer, Vlahovich, et al., 2003Pino, Almora, et al., 2003Rega, Fournier, et al., 2003Choi, Kim. M.-S.L., et al., 2002
Comment MSDC-RI MSDC-RI MSDC-RI MSDC-RI MSDC-RI
Column type CapillaryCapillaryCapillaryCapillaryCapillary
Active phase DB-WaxDB-FFAPDB-FFAPAT-WaxDB-Wax
Column length (m) 60.30.30.60.30.
Carrier gas He  He
Substrate
Column diameter (mm) 0.320.250.250.320.25
Phase thickness (μm) 0.50.250.250.250.25
Tstart (C) 67.35.35.65.35.
Tend (C) 235.200.200.250.200.
Heat rate (K/min) 2.710.10.2.10.
Initial hold (min)  5.5.10.5.
Final hold (min) 30.30.30.60.30.
I 2075.2030.2044.2042.2048.
ReferenceClaudela, Dirningera, et al., 2002Karagül-Yüceer, Cadwallader, et al., 2002Karagül-Yüceer, Cadwallader, et al., 2002Pino, Marbot, et al., 2002Karagül-Yüceer, Drake, et al., 2001
Comment MSDC-RI MSDC-RI MSDC-RI MSDC-RI MSDC-RI
Column type CapillaryCapillaryCapillaryCapillaryCapillary
Active phase CP-Wax 52CBDB-WaxCP-Wax 52CBDB-FFAPDB-Wax
Column length (m) 50.60.60.30.60.
Carrier gas H2HeHeH2N2
Substrate
Column diameter (mm) 0.320.250.250.320.25
Phase thickness (μm)  0.250.250.250.25
Tstart (C) 50.50.45.40.70.
Tend (C) 200.230.250.240.230.
Heat rate (K/min) 2.2.2.5.2.
Initial hold (min)   0.172.2.
Final hold (min)  60.  20.
I 2028.2069.2022.2065.2084.
ReferenceLiu, Yang, et al., 2001Shimoda, Yoshimura, et al., 2001Verzera, Campisi, et al., 2001Charles, Martin, et al., 2000Choi and Sawamura, 2000
Comment MSDC-RI MSDC-RI MSDC-RI MSDC-RI MSDC-RI
Column type CapillaryCapillaryCapillaryCapillaryCapillary
Active phase DB-WaxDB-WaxDB-WaxDB-WaxDB-Wax
Column length (m) 30.30.15.60.30.
Carrier gas H2H2He H2
Substrate
Column diameter (mm) 0.320.320.530.250.32
Phase thickness (μm) 1.1.1.0.251.
Tstart (C) 40.40.40.40.40.
Tend (C) 210.210.220.200.210.
Heat rate (K/min) 3.3.5.3.3.
Initial hold (min)   3.5.
Final hold (min)   30.60.
I 2083.2083.2106.2061.2083.
ReferenceMoio, Piombino, et al., 2000Moio, Piombino, et al., 2000Peng, 2000Cha, Kim, et al., 1998Moio and Addeo, 1998
Comment MSDC-RI MSDC-RI MSDC-RI MSDC-RI MSDC-RI
Column type CapillaryCapillaryCapillaryCapillaryCapillary
Active phase DB-WaxDB-WaxDB-WaxDB-WaxDB-Wax
Column length (m) 30.30.30.30.30.
Carrier gas H2H2 HeHe
Substrate
Column diameter (mm) 0.320.320.320.250.25
Phase thickness (μm) 1.1.0.50.250.25
Tstart (C) 40.40.40.20.20.
Tend (C) 210.210.245.200.200.
Heat rate (K/min) 3.3.3.4.4.
Initial hold (min)   3.5.5.
Final hold (min)   20.10.10.
I 2083.2083.2033.2059.2060.
ReferenceMoio and Addeo, 1998Moio and Addeo, 1998Ollé, Baumes, et al., 1998Ott, Fay, et al., 1997Ott, Fay, et al., 1997
Comment MSDC-RI MSDC-RI MSDC-RI MSDC-RI MSDC-RI
Column type CapillaryCapillaryCapillaryCapillaryCapillary
Active phase PEG-20MDB-WaxDB-WaxDB-WaxDB-Wax
Column length (m) 60.60.60.30.60.
Carrier gas HeHeHeHeHe
Substrate
Column diameter (mm) 0.250.250.250.250.25
Phase thickness (μm) 0.250.250.25 0.25
Tstart (C) 50.50.50.40.50.
Tend (C) 230.230.230.200.230.
Heat rate (K/min) 2.2.3.2.2.
Initial hold (min)    5.
Final hold (min) 60.60.  60.
I 2062.2062.2048.2063.2075.
ReferenceShimoda, Nakada, et al., 1997Shimoda, Shiratsuchi, et al., 1996Shimoda, Wu, et al., 1996Iwaoka, Hagi, et al., 1994Shiratsuchi, Shimoda, et al., 1994
Comment MSDC-RI MSDC-RI MSDC-RI MSDC-RI MSDC-RI
Column type CapillaryCapillaryCapillaryCapillaryCapillary
Active phase DB-WaxDB-WaxCP-Wax 58CBDB-WaxDB-Wax
Column length (m) 30.30.30.30.30.
Carrier gas HeHeHeHeHe
Substrate
Column diameter (mm) 0.250.250.250.250.25
Phase thickness (μm)  0.250.220.250.25
Tstart (C) 40.50.40.50.50.
Tend (C) 200.240.220.250.250.
Heat rate (K/min) 2.4.3.4.4.
Initial hold (min) 10.3. 3.3.
Final hold (min)
I 2056.2050.2035.2039.2040.
ReferenceUmano, Hagi, et al., 1992Krammer, Winterhalter, et al., 1991Pabst, Barron, et al., 1991Fröhlich, Duque, et al., 1989Fröhlich, Duque, et al., 1989
Comment MSDC-RI MSDC-RI MSDC-RI MSDC-RI MSDC-RI
Column type Capillary
Active phase Carbowax 20M
Column length (m) 50.
Carrier gas He
Substrate
Column diameter (mm) 0.32
Phase thickness (μm)
Tstart (C) 50.
Tend (C) 200.
Heat rate (K/min) 2.
Initial hold (min) 5.
Final hold (min) 40.
I 2035.
ReferenceChen, Kuo, et al., 1986
Comment MSDC-RI

Normal alkane RI, non-polar column, temperature ramp

Data compiled by: NIST Mass Spectrometry Data Center, William E. Wallace, director

Column type CapillaryCapillaryCapillaryCapillaryCapillary
Active phase HP-5 MSDB-5VF-5 MSVF-5 MSVF-5 MS
Column length (m) 30.25.60.60.30.
Carrier gas HeliumHeliumHeliumHeliumHelium
Substrate
Column diameter (mm) 0.250.200.320.320.25
Phase thickness (μm) 0.250.330.250.250.25
Tstart (C) 50.50.30.30.40.
Tend (C) 250.240.260.260.250.
Heat rate (K/min) 5.20.2.2.5.
Initial hold (min) 0.51.  3.
Final hold (min) 0.5 28.28.3.
I 1184.1142.1176.1178.1174.
ReferenceFanaro, Duarte, et al., 2012Cais-Sokolinska, Majcher, et al., 2011Leffingwell and Alford, 2011Leffingwell and Alford, 2011Liu, Lu, et al., 2011
Comment MSDC-RI MSDC-RI MSDC-RI MSDC-RI MSDC-RI
Column type CapillaryCapillaryCapillaryCapillaryCapillary
Active phase HP-5 MSHP-5 MSHP-5 MSHP-5 MSHP-5 MS
Column length (m) 30.30.30.30.30.
Carrier gas HeliumHeliumHeliumHeliumHelium
Substrate
Column diameter (mm) 0.250.250.320.250.25
Phase thickness (μm) 0.250.250.250.250.25
Tstart (C) 70.70.50.70.35.
Tend (C) 200.200.240.290.195.
Heat rate (K/min) 3.3.4.5.2.
Initial hold (min) 2.2.2. 5.
Final hold (min) 18.18.10.10.30.
I 1174.1190.1179.1170.1176.
ReferenceJerkovic, Hegic, et al., 2010Jerkovic and Marijanovic, 2010Pino, Marquez, et al., 2010Radulovic, Blagojevic, et al., 2010Kim and Chung, 2009
Comment MSDC-RI MSDC-RI MSDC-RI MSDC-RI MSDC-RI
Column type CapillaryCapillaryCapillaryCapillaryCapillary
Active phase RTX-5HP-5HP-5 MS5 % Phenyl methyl siloxaneDB-5
Column length (m) 30.30.30.30.30.
Carrier gas HeNitrogenHeliumHeHe
Substrate
Column diameter (mm) 0.250.250.250.250.25
Phase thickness (μm) 0.250.250.251.0.25
Tstart (C) 40.50.50.40.60.
Tend (C) 250.280.250.250.320.
Heat rate (K/min) 20.5.6.57.10.
Initial hold (min) 5.1.1.510.
Final hold (min)  1.10.5.4.
I 1226.1180.1182.1179.1166.
ReferencePham, Schilling, et al., 2008Saidana, Mahjoub, et al., 2008Thakeow, Angeli, et al., 2008Ramirez R. and Cava R., 2007Smelcerovic, Spiteller, et al., 2007
Comment MSDC-RI MSDC-RI MSDC-RI MSDC-RI MSDC-RI
Column type CapillaryCapillaryCapillaryCapillaryCapillary
Active phase HP-5HP-5DB-5DB-5BPX-5
Column length (m) 25.25.30.30.25.
Carrier gas   HeN2Helium
Substrate
Column diameter (mm) 0.20.20.320.250.20
Phase thickness (μm) 0.320.320.250.250.13
Tstart (C) 40.40.40.70.50.
Tend (C) 250.250.250.230.230.
Heat rate (K/min) 5.5.4.2.3.
Initial hold (min) 1.1.2.2.2.
Final hold (min)   5.20.
I 1203.1203.1180.1192.1160.
ReferenceTapia, Perich, et al., 2007Tapia, Perich, et al., 2007Xu, Fan, et al., 2007Choi, 2006Fons, Rapior, et al., 2006
Comment MSDC-RI MSDC-RI MSDC-RI MSDC-RI MSDC-RI
Column type CapillaryCapillaryCapillaryCapillaryCapillary
Active phase DB-1Polymethylsiloxane, (PMS-20000)DB-5HP-5HP-5
Column length (m) 30.25.30.30.30.
Carrier gas HeHeN2HeliumHelium
Substrate
Column diameter (mm) 0.250.200.320.320.32
Phase thickness (μm) 0.25 0.250.250.25
Tstart (C) 50.50.40.40.40.
Tend (C) 265.250.250.250.250.
Heat rate (K/min) 2.53.4.5.5.
Initial hold (min) 1.3.2.2.2.
Final hold (min) 20. 5.5.5.
I 1158.1218.1171.1182.1185.
ReferenceIranshahi, Amin, et al., 2006Dohou, Yamni, et al., 2005Fan and Qian, 2005N/AN/A
Comment MSDC-RI MSDC-RI MSDC-RI MSDC-RI MSDC-RI
Column type CapillaryCapillaryCapillaryCapillaryCapillary
Active phase HP-55 % Phenyl methyl siloxaneSPB-5SPB-5RSL-200
Column length (m) 30.0.30.60.30.
Carrier gas HeliumHeHeHeliumH2
Substrate
Column diameter (mm) 0.320.250.320.320.32
Phase thickness (μm) 0.251.0.251.00.25
Tstart (C) 40.40.40.30.40.
Tend (C) 250.250.220.230.280.
Heat rate (K/min) 5.7.5.3.6.
Initial hold (min) 2.10.1. 5.
Final hold (min) 5.5.20. 5.
I 1185.1179.1199.1156.1169.
ReferenceN/ARamírez, Estévez, et al., 2004Ledauphin, Guichard, et al., 2003Sebastian, Viallon-Fernandez, et al., 2003Jirovetz, Buchbauer, et al., 2002
Comment MSDC-RI MSDC-RI MSDC-RI MSDC-RI MSDC-RI
Column type CapillaryCapillaryCapillaryCapillaryCapillary
Active phase RSL-200SPB-5Optima-1Optima-1HP-5
Column length (m) 30.30.25.25.30.
Carrier gas H2HeliumHeHeH2
Substrate
Column diameter (mm) 0.250.250.200.200.25
Phase thickness (μm) 0.250.250.250.250.25
Tstart (C) 40.60.50.50.40.
Tend (C) 280.250.250.250.280.
Heat rate (K/min) 6.4.3.3.3.
Initial hold (min) 2.2.3.3.10.
Final hold (min) 10.20.  10.
I 1167.1180.1186.1183.1186.
ReferenceJirovetz, Smith, et al., 2002Pino, Marbot, et al., 2002Brun, Bessière, et al., 2001de Beck, Bessière, et al., 2000Bicalho, Pereira, et al., 2000
Comment MSDC-RI MSDC-RI MSDC-RI MSDC-RI MSDC-RI
Column type CapillaryCapillaryCapillaryCapillaryCapillary
Active phase OV-101Methyl SiliconeBP-5HP-1DB-1
Column length (m) 50.60.50.25.60.
Carrier gas Nitrogen He
Substrate
Column diameter (mm) 0.250.250.320.320.25
Phase thickness (μm)  0.251.
Tstart (C) 40.40.40.35.30.
Tend (C) 200.220.190.250.200.
Heat rate (K/min) 2.5.2.4.4.
Initial hold (min) 10.10.5. 25.
Final hold (min)     20.
I 1165.1150.001214.1165.1162.
ReferenceTamura, Boonbumrung, et al., 2000Baraldi, Rapparini, et al., 1999Ferreira, Ardanuy, et al., 1998Ong, Acree, et al., 1998Buttery, Ling, et al., 1997
Comment MSDC-RI MSDC-RI MSDC-RI MSDC-RI MSDC-RI
Column type CapillaryCapillaryCapillaryCapillaryCapillary
Active phase Ultra-2Ultra-2DB-5DB-5DB-1
Column length (m) 50.50.60.60.60.
Carrier gas HeHeHe He
Substrate
Column diameter (mm) 0.320.320.320.250.25
Phase thickness (μm) 0.520.521.00.250.25
Tstart (C) 40.40.40.40.50.
Tend (C) 250.250.240.250.240.
Heat rate (K/min) 4.4.3.2.3.
Initial hold (min) 3.3. 5.
Final hold (min) 30.30.
I 1189.1189.1177.1183.1158.
ReferenceKing, Matthews, et al., 1995King, Hamilton, et al., 1993Berdague, Denoyer, et al., 1991Lee, Macku, et al., 1991Shiota, 1991
Comment MSDC-RI MSDC-RI MSDC-RI MSDC-RI MSDC-RI
Column type Capillary
Active phase DB-1
Column length (m) 60.
Carrier gas He
Substrate
Column diameter (mm) 0.25
Phase thickness (μm) 0.25
Tstart (C) 50.
Tend (C) 240.
Heat rate (K/min) 3.
Initial hold (min)
Final hold (min)
I 1209.
ReferenceShiota, 1991
Comment MSDC-RI

Lee's RI, non-polar column, temperature ramp

Data compiled by: NIST Mass Spectrometry Data Center, William E. Wallace, director

Column type CapillaryCapillary
Active phase DB-5MSDB-5
Column length (m) 30.30.
Carrier gas  He
Substrate
Column diameter (mm) 0.250.32
Phase thickness (μm) 0.50.25
Tstart (C) 40.40.
Tend (C) 310.285.
Heat rate (K/min) 10.8.
Initial hold (min) 1.3.
Final hold (min)  29.5
I 198.43196.6
ReferenceChen, Keeran, et al., 2002Donnelly, Abdel-Hamid, et al., 1993
Comment MSDC-RI MSDC-RI

References

Adriaanse, Dekker, et al., 1965
Adriaanse, N.; Dekker, H.; Coops, J.,
Heats of combustion of normal saturated fatty acids and their methyl esters,
Rec. Trav. Chim. Pays/Bas, 1965, 84, 393-407. [all data]
Baccanari, Novinski, et al., 1968
Baccanari, D.P.; Novinski, J.A.; Pan, Y.; Yevitz, M.M.; Swain, H.A., Jr.,
Heats of sublimation and vaporization at 25° of long chain fatty acids and methyl esters,
Trans. Faraday Soc., 1968, 64, 1201. [all data]
Lebedeva, 1964
Lebedeva, N.D.,
Heats of combustion of monocarboxylic acids,
Russ. J. Phys. Chem. (Engl. Transl.), 1964, 38, 1435-1437. [all data]
Schaake, van Miltenburg, et al., 1982
Schaake, R.C.F.; van Miltenburg, J.C.; De Kruif, C.G.,
Thermodynamic properties of the normal alkanoic acids. II. Molar heat capacities of seven even-numbered normal alkanoic acids,
J. Chem. Thermodynam., 1982, 14, 771-778. [all data]
Garner and Randall, 1924
Garner, W.E.; Randall, F.C.,
Alternation in the heats of crystallization of the normal monobasic fatty acids. Part I.,
J. Chem. Soc., 1924, 125, 881-896. [all data]
Schaake, van Miltenburg, et al., 1982, 2
Schaake, R.C.F.; van Miltenburg, J.C.; De Kruif, C.G.,
Thermodynamic properties of the normal alkanoic acids. II. Molar heat capacities of seven even-numbered normal alkanoic acids.,
J. Chem. Thermodyn., 1982, 14, 771-8. [all data]
Andereya and Chase, 1990
Andereya, E.; Chase, J.D.,
Chem. Eng. Technol., 1990, 13, 304-12. [all data]
Ambrose and Ghiassee, 1987
Ambrose, D.; Ghiassee, N.B.,
Vapor Pressures and Critical Temperatures and Critical Pressures of Some Alkanoic Acids: C1 to C10,
J. Chem. Thermodyn., 1987, 19, 505. [all data]
D'Souza and Teja, 1987
D'Souza, R.; Teja, A.S.,
The prediction of the vapor pressures of carboxylic acids,
Chem. Eng. Commun., 1987, 61, 13. [all data]
Verevkin, 2000
Verevkin, S.P.,
Measurement and Prediction of the Monocarboxylic Acids Thermochemical Properties,
J. Chem. Eng. Data, 2000, 45, 5, 953-960, https://doi.org/10.1021/je990282m
. [all data]
Chickos, Hosseini, et al., 1995
Chickos, James S.; Hosseini, Sarah; Hesse, Donald G.,
Determination of vaporization enthalpies of simple organic molecules by correlations of changes in gas chromatographic net retention times,
Thermochimica Acta, 1995, 249, 41-62, https://doi.org/10.1016/0040-6031(95)90670-3
. [all data]
Kruif and Oonk, 1979
Kruif, C.G.; Oonk, H.A.J.,
Enthalpies of vaporization and vapour pressures of seven aliphatic carboxylic acids,
J. Chem. Thermodyn., 1979, 11, 287-290. [all data]
Cappa, Lovejoy, et al., 2008
Cappa, Christopher D.; Lovejoy, Edward R.; Ravishankara, A.R.,
Evaporation Rates and Vapor Pressures of the Even-Numbered C 8 -C 18 Monocarboxylic Acids,
J. Phys. Chem. A, 2008, 112, 17, 3959-3964, https://doi.org/10.1021/jp710586m
. [all data]
Ambrose and Ghiassee, 1987, 2
Ambrose, D.; Ghiassee, N.B.,
Vapour pressures and critical temperatures and critical pressures of some alkanoic acids: C1 to C10,
The Journal of Chemical Thermodynamics, 1987, 19, 5, 505-519, https://doi.org/10.1016/0021-9614(87)90147-9
. [all data]
Stephenson and Malanowski, 1987
Stephenson, Richard M.; Malanowski, Stanislaw,
Handbook of the Thermodynamics of Organic Compounds, 1987, https://doi.org/10.1007/978-94-009-3173-2
. [all data]
de Kruif, Schaake, et al., 1982
de Kruif, C.G.; Schaake, R.C.F.; van Miltenburg, J.C.; van der Klauw, K.; Blok, J.G.,
Thermodynamic properties of the normal alkanoic acids III. Enthalpies of vaporization and vapour pressures of 13 normal alkanoic acids,
The Journal of Chemical Thermodynamics, 1982, 14, 8, 791-798, https://doi.org/10.1016/0021-9614(82)90176-8
. [all data]
Cramer, 1943
Cramer, K.S.N.,
Chem. Zentr. II, 1943, 2234. [all data]
Rose, Acciarri, et al., 1957
Rose, Arthur.; Acciarri, Jerry A.; Johnson, R. Curtis.; Sanders, W.W.,
Automatic Computation of Antoine Equation 31 Constants---Caproic and Caprylic Acids and Methyl Esters,
Ind. Eng. Chem., 1957, 49, 1, 104-109, https://doi.org/10.1021/ie50565a036
. [all data]
Domalski and Hearing, 1996
Domalski, Eugene S.; Hearing, Elizabeth D.,
Heat Capacities and Entropies of Organic Compounds in the Condensed Phase. Volume III,
J. Phys. Chem. Ref. Data, 1996, 25, 1, 1, https://doi.org/10.1063/1.555985
. [all data]