CAS Reg. No. 124053-54-9
- CAS Registry Number: 124053-54-9

Reaction thermochemistry data

Data compiled by: John E. Bartmess
Individual Reactions
(CAS Reg. No. 124053-54-9 • 4294967295) +
= CAS Reg. No. 124053-54-9
By formula: (CAS Reg. No. 124053-54-9 • 4294967295Au) + Au = CAS Reg. No. 124053-54-9
Quantity | Value | Units | Method | Reference | Comment |
---|---|---|---|---|---|
ΔrH° | <91.3 ± 9.2 | kcal/mol | CIDT | Spasov, Shi, et al., 2000 | gas phase |

References

Spasov, Shi, et al., 2000
Spasov, V.A.; Shi, Y.; Ervin, K.M.,
Time-resolved photodissociation and threshold collision-induced dissociation of anionic gold clusters,
Chem. Phys., 2000, 262, 1, 75-91, https://doi.org/10.1016/S0301-0104(00)00165-8
. [all data]