Hexanedioic acid
- Formula: C6H10O4
- Molecular weight: 146.1412
- IUPAC Standard InChIKey: WNLRTRBMVRJNCN-UHFFFAOYSA-N
- CAS Registry Number: 124-04-9
- Chemical structure:
View 3d structure (requires JavaScript / HTML 5) - Other names: Adipic acid; Acifloctin; Acinetten; Adilactetten; 1,4-Butanedicarboxylic acid; 1,6-Hexanedioic acid; Adipinic acid; Kyselina adipova; Adi-pure; NSC 7622; Hexanedioc acid

Condensed phase thermochemistry data

Data compiled as indicated in comments:
ALS - Hussein Y. Afeefy, Joel F. Liebman, and Stephen E. Stein
DH - Eugene S. Domalski and Elizabeth D. Hearing
Quantity | Value | Units | Method | Reference | Comment |
---|---|---|---|---|---|
ΔfH°solid | -1021.32 | kJ/mol | Ccb | Contineanu, Corlateanu, et al., 1980 | ALS |
ΔfH°solid | -998.22 ± 0.42 | kJ/mol | Ccb | Babinkov, Nistratov, et al., 1979 | ALS |
Quantity | Value | Units | Method | Reference | Comment |
ΔcH°solid | -2768.7 ± 5.9 | kJ/mol | Ccb | Contineanu, Corlateanu, et al., 1980 | Corresponding ΔfHºsolid = -1021.53 kJ/mol (simple calculation by NIST; no Washburn corrections); ALS |
ΔcH°solid | -2791.98 ± 0.42 | kJ/mol | Ccb | Babinkov, Nistratov, et al., 1979 | Corresponding ΔfHºsolid = -998.23 kJ/mol (simple calculation by NIST; no Washburn corrections); ALS |
ΔcH°solid | -2795.9 ± 0.75 | kJ/mol | Ccr | Sunner, 1946 | Corresponding ΔfHºsolid = -994.33 kJ/mol (simple calculation by NIST; no Washburn corrections); ALS |
ΔcH°solid | -2802.4 ± 1.4 | kJ/mol | Ccb | Verkade, Hartman, et al., 1926 | Reanalyzed by Cox and Pilcher, 1970, Original value = -2799. kJ/mol; See Verkade, Hartman, et al., 1924; Corresponding ΔfHºsolid = -987.76 kJ/mol (simple calculation by NIST; no Washburn corrections); ALS |

Gas phase ion energetics data

Data compiled by: John E. Bartmess
De-protonation reactions
C6H9O4- + =
By formula: C6H9O4- + H+ = C6H10O4
Quantity | Value | Units | Method | Reference | Comment |
---|---|---|---|---|---|
ΔrH° | 1360. ± 8.4 | kJ/mol | CIDC | Kumar, Prabhakar, et al., 2005 | gas phase |
Quantity | Value | Units | Method | Reference | Comment |
ΔrG° | 1343. ± 8.4 | kJ/mol | CIDC | Kumar, Prabhakar, et al., 2005 | gas phase |

Phase change data

Data compiled as indicated in comments:
BS - Robert L. Brown and Stephen E. Stein
DH - Eugene S. Domalski and Elizabeth D. Hearing
TRC - Thermodynamics Research Center, NIST Boulder Laboratories, Chris Muzny director
AC - William E. Acree, Jr., James S. Chickos
ALS - Hussein Y. Afeefy, Joel F. Liebman, and Stephen E. Stein
Quantity | Value | Units | Method | Reference | Comment |
---|---|---|---|---|---|
Tfus | 425. ± 4. | K | AVG | N/A | Average of 12 values; Individual data points |
Quantity | Value | Units | Method | Reference | Comment |
Ttriple | 424.7 | K | N/A | Babinkov, Nistratov, et al., 1979, 2 | Uncertainty assigned by TRC = 0.3 K; TRC |
Quantity | Value | Units | Method | Reference | Comment |
ΔvapH° | 25.14 | kcal/mol | CGC | Roux, Temprado, et al., 2005 | Based on data from 424. to 503. K.; AC |
Quantity | Value | Units | Method | Reference | Comment |
ΔsubH° | 31.93 ± 0.31 | kcal/mol | ME | Ribeiro da Silva, Monte, et al., 1999 | See also Davies and Thomas, 1960.; AC |
ΔsubH° | 30.9 ± 0.3 | kcal/mol | V | Davies and Thomas, 1960 | ALS |
Reduced pressure boiling point
Tboil (K) | Pressure (atm) | Reference | Comment |
---|---|---|---|
538.2 | 0.132 | Weast and Grasselli, 1989 | BS |
Enthalpy of vaporization
ΔvapH (kcal/mol) | Temperature (K) | Method | Reference | Comment |
---|---|---|---|---|
22.0 | 447. | A | Stephenson and Malanowski, 1987 | Based on data from 432. to 611. K. See also Stull, 1947.; AC |
Antoine Equation Parameters
log10(P) = A − (B / (T + C))
P = vapor pressure (atm)
T = temperature (K)
View plot Requires a JavaScript / HTML 5 canvas capable browser.
Temperature (K) | A | B | C | Reference | Comment |
---|---|---|---|---|---|
432.7 to 610.7 | 5.46735 | 2813.066 | -95.951 | Stull, 1947 | Coefficents calculated by NIST from author's data. |
Enthalpy of sublimation
ΔsubH (kcal/mol) | Temperature (K) | Method | Reference | Comment |
---|---|---|---|---|
29.8 ± 4.8 | 353. to 373. | ME | Taulelle, Sitja, et al., 2009 | AC |
34.7 ± 1. | 328. to 368. | TPD | Cappa, Lovejoy, et al., 2007 | AC |
34.94 | 285. to 307. | TPTD | Chattopadhyay and Ziemann, 2005 | AC |
33.5 | 295. to 318. | TPTD | Chattopadhyay, Tobias, et al., 2001 | Values based on TPTD method are not consistent with values determined by other experimental methods; AC |
30.90 ± 0.60 | 383. | ME | Nitta, Seki, et al., 1950 | Based on data from 359. to 406. K. See also Jones, 1960 and Cox and Pilcher, 1970, 2.; AC |
Enthalpy of fusion
ΔfusH (kcal/mol) | Temperature (K) | Reference | Comment |
---|---|---|---|
8.3298 | 425.5 | Cingolani and Berchiesi, 1974 | DH |
8.05 | 419. | Roux, Temprado, et al., 2005 | AC |
8.329 | 426.4 | Acree, 1991 | AC |
Entropy of fusion
ΔfusS (cal/mol*K) | Temperature (K) | Reference | Comment |
---|---|---|---|
19.58 | 425.5 | Cingolani and Berchiesi, 1974 | DH |

Reaction thermochemistry data

Data compiled by: John E. Bartmess
Individual Reactions
C6H9O4- + =
By formula: C6H9O4- + H+ = C6H10O4
Quantity | Value | Units | Method | Reference | Comment |
---|---|---|---|---|---|
ΔrH° | 325.1 ± 2.0 | kcal/mol | CIDC | Kumar, Prabhakar, et al., 2005 | gas phase |
Quantity | Value | Units | Method | Reference | Comment |
ΔrG° | 321.1 ± 2.0 | kcal/mol | CIDC | Kumar, Prabhakar, et al., 2005 | gas phase |

Van Den Dool and Kratz RI, non-polar column, custom temperature program

Column type | Active phase | I | Reference | Comment |
---|---|---|---|---|
Capillary | VF-5MS | 1372.4 | Tret'yakov, 2007 | 30. m/0.25 mm/0.25 μm, He; Program: Multi-step temperature program; T(initial)=60C; T(final)=270C |

Normal alkane RI, polar column, custom temperature program

Column type | Active phase | I | Reference | Comment |
---|---|---|---|---|
Capillary | Carbowax 20M | 2137. | Editorial paper, 2005 | Program: not specified |

Henry's Law data

Data compiled by: Rolf Sander

Henry's Law constant (water solution)

kH(T) = H exp(d(ln(kH))/d(1/T) ((1/T) - 1/(298.15 K)))
H = Henry's law constant for solubility in water at 298.15 K (mol/(kg*bar))
d(ln(kH))/d(1/T) = Temperature dependence constant (K)

H (mol/(kg*bar)) d(ln(kH))/d(1/T) (K) Method Reference Comment
2.0×10+8 EN/AValue obtained by missing citation using the group contribution method.
1.8×10+711000.XN/A

References

Contineanu, Corlateanu, et al., 1980
Contineanu, I.; Corlateanu, E.; Hersocovici, J.; Marchidan, D.I.,
Combustion and formation enthalpies of 1,6-hexanediol and adipic acid,
Rev. Chim. (Bucharest), 1980, 31, 763-764. [all data]
Babinkov, Nistratov, et al., 1979
Babinkov, A.G.; Nistratov, V.P.; Larina, V.N.; Shvetsova, K.G.; Sapozhnikov, V.N.; Zhilitskaya, O.M.,
Thermodynamic properties of adipic acid,
Termodin. Org. Soedin., 1979, 28-33. [all data]
Sunner, 1946
Sunner, S.,
Determination of combustion heats of organo-sulphur compounds,
Svensk. Kim. Tidr., 1946, 58, 71-81. [all data]
Verkade, Hartman, et al., 1926
Verkade, P.E.; Hartman, H.; Coops, J.,
Calorimetric researches. X. Heats of combustion of successive terms of homologous series: dicarboxylic acids of the oxalic acid series,
Rec. Trav. Chim. Pays/Bas, 1926, 45, 373-393. [all data]
Cox and Pilcher, 1970
Cox, J.D.; Pilcher, G.,
Thermochemistry of Organic and Organometallic Compounds, Academic Press, New York, 1970, 1-636. [all data]
Verkade, Hartman, et al., 1924
Verkade, P.E.; Hartman, H.; Coops, J., Jr.,
Chemistry - The molecular heat of combustion of successive terms of homologous series,
Kom. Med. Akad. Ueknschap. Proc., 1924, 27, 859-866. [all data]
Kumar, Prabhakar, et al., 2005
Kumar, M.R.; Prabhakar, S.; Nagaveni, V.; Vairamani, M.,
Estimation of gas-phase acidities of a series of dicarboxylic acids by the kinetic method,
Rapid Commun. Mass Spectrom., 2005, 19, 8, 1053-1057, https://doi.org/10.1002/rcm.1888
. [all data]