Benzonitrile, 4-nitro- anion
- Formula: C7H4N2O2-
- Molecular weight: 148.1194
- CAS Registry Number: 12402-47-0

Reaction thermochemistry data

Data compiled as indicated in comments:
B - John E. Bartmess
M - Michael M. Meot-Ner (Mautner) and Sharon G. Lias
Individual Reactions
By formula: C7H4N2O2- + CH4O = (C7H4N2O2- • CH4O)
Quantity | Value | Units | Method | Reference | Comment |
---|---|---|---|---|---|
ΔrH° | 13.9 ± 2.0 | kcal/mol | N/A | Chowdhury, Grimsrud, et al., 1987 | gas phase; Free energy affinity at 70°C.; B,M |
Quantity | Value | Units | Method | Reference | Comment |
ΔrS° | 28.6 | cal/mol*K | PHPMS | Chowdhury, 1987 | gas phase; M |
Quantity | Value | Units | Method | Reference | Comment |
ΔrG° | 4.1 ± 2.0 | kcal/mol | TDAs | Chowdhury, Grimsrud, et al., 1987 | gas phase; Free energy affinity at 70°C.; B |
By formula: C7H4N2O2- + C2H3N = (C7H4N2O2- • C2H3N)
Quantity | Value | Units | Method | Reference | Comment |
---|---|---|---|---|---|
ΔrH° | 13.9 ± 2.0 | kcal/mol | N/A | Chowdhury, Grimsrud, et al., 1987 | gas phase; Free energy affinity at 70°C.; B,M |
Quantity | Value | Units | Method | Reference | Comment |
ΔrS° | 28.6 | cal/mol*K | PHPMS | Chowdhury, 1987 | gas phase; M |
Quantity | Value | Units | Method | Reference | Comment |
ΔrG° | 4.1 ± 2.0 | kcal/mol | TDAs | Chowdhury, Grimsrud, et al., 1987 | gas phase; Free energy affinity at 70°C.; B |
By formula: C7H4N2O2- + C4H8O = (C7H4N2O2- • C4H8O)
Quantity | Value | Units | Method | Reference | Comment |
---|---|---|---|---|---|
ΔrG° | 1.4 ± 1.6 | kcal/mol | IMRE | Chowdhury, Grimsrud, et al., 1987 | gas phase; Free energy affinity at 35°C.; B |
Free energy of reaction
ΔrG° (kcal/mol) | T (K) | Method | Reference | Comment |
---|---|---|---|---|
1.4 | 308. | PHPMS | Chowdhury, 1987 | gas phase; M |
By formula: C7H4N2O2- + C3H7NO = (C7H4N2O2- • C3H7NO)
Quantity | Value | Units | Method | Reference | Comment |
---|---|---|---|---|---|
ΔrG° | 3.9 ± 1.6 | kcal/mol | IMRE | Chowdhury, Grimsrud, et al., 1987 | gas phase; Free energy affinity at 70°C.; B |
Free energy of reaction
ΔrG° (kcal/mol) | T (K) | Method | Reference | Comment |
---|---|---|---|---|
3.9 | 343. | PHPMS | Chowdhury, 1987 | gas phase; M |
By formula: C7H4N2O2- + C2H6OS = (C7H4N2O2- • C2H6OS)
Quantity | Value | Units | Method | Reference | Comment |
---|---|---|---|---|---|
ΔrH° | 16.0 | kcal/mol | PHPMS | Chowdhury, 1987 | gas phase; M |
Quantity | Value | Units | Method | Reference | Comment |
ΔrS° | 33.6 | cal/mol*K | PHPMS | Chowdhury, 1987 | gas phase; M |

Ion clustering data

Data compiled as indicated in comments:
B - John E. Bartmess
M - Michael M. Meot-Ner (Mautner) and Sharon G. Lias
Clustering reactions
By formula: C7H4N2O2- + CH4O = (C7H4N2O2- • CH4O)
Quantity | Value | Units | Method | Reference | Comment |
---|---|---|---|---|---|
ΔrH° | 13.9 ± 2.0 | kcal/mol | N/A | Chowdhury, Grimsrud, et al., 1987 | gas phase; Free energy affinity at 70°C.; B,M |
Quantity | Value | Units | Method | Reference | Comment |
ΔrS° | 28.6 | cal/mol*K | PHPMS | Chowdhury, 1987 | gas phase; M |
Quantity | Value | Units | Method | Reference | Comment |
ΔrG° | 4.1 ± 2.0 | kcal/mol | TDAs | Chowdhury, Grimsrud, et al., 1987 | gas phase; Free energy affinity at 70°C.; B |
By formula: C7H4N2O2- + C2H3N = (C7H4N2O2- • C2H3N)
Quantity | Value | Units | Method | Reference | Comment |
---|---|---|---|---|---|
ΔrH° | 13.9 ± 2.0 | kcal/mol | N/A | Chowdhury, Grimsrud, et al., 1987 | gas phase; Free energy affinity at 70°C.; B,M |
Quantity | Value | Units | Method | Reference | Comment |
ΔrS° | 28.6 | cal/mol*K | PHPMS | Chowdhury, 1987 | gas phase; M |
Quantity | Value | Units | Method | Reference | Comment |
ΔrG° | 4.1 ± 2.0 | kcal/mol | TDAs | Chowdhury, Grimsrud, et al., 1987 | gas phase; Free energy affinity at 70°C.; B |
By formula: C7H4N2O2- + C2H6OS = (C7H4N2O2- • C2H6OS)
Quantity | Value | Units | Method | Reference | Comment |
---|---|---|---|---|---|
ΔrH° | 16.0 | kcal/mol | PHPMS | Chowdhury, 1987 | gas phase; M |
Quantity | Value | Units | Method | Reference | Comment |
ΔrS° | 33.6 | cal/mol*K | PHPMS | Chowdhury, 1987 | gas phase; M |
By formula: C7H4N2O2- + C3H7NO = (C7H4N2O2- • C3H7NO)
Quantity | Value | Units | Method | Reference | Comment |
---|---|---|---|---|---|
ΔrG° | 3.9 ± 1.6 | kcal/mol | IMRE | Chowdhury, Grimsrud, et al., 1987 | gas phase; Free energy affinity at 70°C.; B |
Free energy of reaction
ΔrG° (kcal/mol) | T (K) | Method | Reference | Comment |
---|---|---|---|---|
3.9 | 343. | PHPMS | Chowdhury, 1987 | gas phase; M |
By formula: C7H4N2O2- + C4H8O = (C7H4N2O2- • C4H8O)
Quantity | Value | Units | Method | Reference | Comment |
---|---|---|---|---|---|
ΔrG° | 1.4 ± 1.6 | kcal/mol | IMRE | Chowdhury, Grimsrud, et al., 1987 | gas phase; Free energy affinity at 35°C.; B |
Free energy of reaction
ΔrG° (kcal/mol) | T (K) | Method | Reference | Comment |
---|---|---|---|---|
1.4 | 308. | PHPMS | Chowdhury, 1987 | gas phase; M |

Gas phase thermochemistry data

Data compiled by: John E. Bartmess

Quantity Value Units Method Reference Comment
Δfgas11.1 ± 2.5kcal/molR-EAChowdhury, Heinis, et al., 1986ΔGea(423 K) = -38.7 kcal/mol; ΔSea = -2.7 eu.

References

Chowdhury, Grimsrud, et al., 1987
Chowdhury, S.; Grimsrud, E.P.; Kebarle, P.,
Bonding of Charged Delocalized Anions to Protic and Dipolar Aprotic Solvent Molecules,
J. Phys. Chem., 1987, 91, 10, 2551, https://doi.org/10.1021/j100294a021
. [all data]
Chowdhury, 1987
Chowdhury, S. Grimsrud,
Bonding of Charge Delocalized Anions to Protic and Dipolar Aprotic Solvents,
J. Phys. Chem., 1987, 91, 10, 2551, https://doi.org/10.1021/j100294a021
. [all data]