Thiomorpholine
- Formula: C4H9NS
- Molecular weight: 103.186
- IUPAC Standard InChIKey: BRNULMACUQOKMR-UHFFFAOYSA-N
- CAS Registry Number: 123-90-0
- Chemical structure:
View 3d structure (requires JavaScript / HTML 5) - Other names: Thiamorpholine; Parathiazan; Tetrahydro-1,4-thiazine; 1,4-Thiazan; 1-Thia-4-azacyclohexane; 1,4-Thiazane; 1,4-Thiazine, tetrahydro-; thiazolidinane

Phase change data

Data compiled by: Robert L. Brown and Stephen E. Stein
Quantity | Value | Units | Method | Reference | Comment |
---|---|---|---|---|---|
Tboil | 442.2 | K | N/A | Aldrich Chemical Company Inc., 1990 |
Reduced pressure boiling point
Tboil (K) | Pressure (bar) | Reference |
---|---|---|
447.2 | 0.995 | Weast and Grasselli, 1989 |
383.2 | 0.133 | Weast and Grasselli, 1989 |

Kovats' RI, non-polar column, isothermal

Column type | Active phase | Temperature (C) | I | Reference | Comment |
---|---|---|---|---|---|
Capillary | OV-101 | 110. | 973. | Zhuravleva, 2000 | 50. m/0.3 mm/0.4 μm, He |

References

Aldrich Chemical Company Inc., 1990
Aldrich Chemical Company Inc.,
Catalog Handbook of Fine Chemicals, Aldrich Chemical Company, Inc., Milwaukee WI, 1990, 1. [all data]
Weast and Grasselli, 1989
CRC Handbook of Data on Organic Compounds, 2nd Editon, Weast,R.C and Grasselli, J.G., ed(s)., CRC Press, Inc., Boca Raton, FL, 1989, 1. [all data]
Zhuravleva, 2000
Zhuravleva, I.L.,
Evaluation of the polarity and boiling points of nitrogen-containing heterocyclic compounds by gas chromatography,
Russ. Chem. Bull. (Engl. Transl.), 2000, 49, 2, 325-328, https://doi.org/10.1007/BF02494682
. [all data]