Hydrogen fluoride, positive ion
- Formula: FH+
- Molecular weight: 20.00579
- IUPAC Standard InChIKey: GCZNJFDPFDGYDB-UHFFFAOYSA-N
- CAS Registry Number: 12381-92-9
- Chemical structure:
View 3d structure (requires JavaScript / HTML 5) - Permanent link for this species. Use this link for bookmarking this species for future reference.

Reaction thermochemistry data

Data compiled by: Michael M. Meot-Ner (Mautner) and Sharon G. Lias
Individual Reactions
By formula: HF+ + HF = (HF+ • HF)
Quantity | Value | Units | Method | Reference | Comment |
---|---|---|---|---|---|
ΔrH° | 140. | kJ/mol | PI | Tiedemann, Anderson, et al., 1979 | gas phase; ΔrH> |

Ion clustering data

Data compiled by: Michael M. Meot-Ner (Mautner) and Sharon G. Lias
Clustering reactions
By formula: HF+ + HF = (HF+ • HF)
Quantity | Value | Units | Method | Reference | Comment |
---|---|---|---|---|---|
ΔrH° | 140. | kJ/mol | PI | Tiedemann, Anderson, et al., 1979 | gas phase; ΔrH> |

References

Tiedemann, Anderson, et al., 1979
Tiedemann, P.W.; Anderson, S.L.; Ceyer, S.T.; Hirooka, T.; Ng, C.Y.; Mahan, B.H.; Lee, Y.T.,
Proton affinities of hydrogen halides determined by the molecular beam photoionization method,
J. Chem. Phys., 1979, 71, 605. [all data]