1,2-Ethanediol, dipropanoate
- Formula: C8H14O4
- Molecular weight: 174.1944
- IUPAC Standard InChIKey: UMNVUZRZKPVECS-UHFFFAOYSA-N
- CAS Registry Number: 123-80-8
- Chemical structure:
View 3d structure (requires JavaScript / HTML 5) - Other names: Ethylene glycol, dipropionate; Ethylene dipropionate; Ethylene propionate; Ethylene glycol, dipropanoate ester; Dipropanoate-1,2-ethandiol

Condensed phase thermochemistry data

Data compiled by: Eugene S. Domalski and Elizabeth D. Hearing
Constant pressure heat capacity of liquid
Cp,liquid (J/mol*K) | Temperature (K) | Reference |
---|---|---|
331.8 | 298.15 | Nilsson and Wadso, 1986 |

Phase change data

Data compiled as indicated in comments:
ALS - Hussein Y. Afeefy, Joel F. Liebman, and Stephen E. Stein
AC - William E. Acree, Jr., James S. Chickos
Quantity | Value | Units | Method | Reference | Comment |
---|---|---|---|---|---|
ΔvapH° | 67.59 ± 0.50 | kJ/mol | C | Nilsson and Wadso, 1986 | ALS |
ΔvapH° | 67.6 ± 0.5 | kJ/mol | C | Nilsson and Wadso, 1986 | AC |

Kovats' RI, non-polar column, isothermal

Column type | Active phase | Temperature (C) | I | Reference | Comment |
---|---|---|---|---|---|
Packed | Apiezon L | 160. | 1075. | Bogoslovsky, Anvaer, et al., 1978 | Celite 545 |

Normal alkane RI, polar column, temperature ramp

Column type | Active phase | I | Reference | Comment |
---|---|---|---|---|
Capillary | FFAP | 1630. | Nebesny, Budryn, et al., 2007 | 30. m/0.32 mm/0.5 μm, N2, 35. C @ 5. min, 4. K/min, 320. C @ 45. min |

References

Nilsson and Wadso, 1986
Nilsson, S.-O.; Wadso, I.,
Thermodynamic properties of some mono-, di-, and tri esters. Enthalpies of solution in water at 288.15 to 318.15 K and enthalpies of vaporization and heat capacities at 298.15 K,
J. Chem. Thermodyn., 1986, 18, 673-681. [all data]
Bogoslovsky, Anvaer, et al., 1978
Bogoslovsky, Yu.N.; Anvaer, B.I.; Vigdergauz, M.S.,
Chromatographic constants in gas chromatography (in Russian), Standards Publ. House, Moscow, 1978, 192. [all data]
Nebesny, Budryn, et al., 2007
Nebesny, E.; Budryn, G.; Kula, J.; Majda, T.,
The effect of roasting method on headspace composition of robusta coffee bean aroma,
Eur. Food Res. Technol., 2007, 225, 1, 9-19, https://doi.org/10.1007/s00217-006-0375-0
. [all data]