Hexanedioic acid, dioctyl ester

Van Den Dool and Kratz RI, polar column, temperature ramp

View large format table.

Column type Active phase I Reference Comment
CapillaryDB-Wax2846.Shiratsuchi, Shimoda, et al., 199460. m/0.25 mm/0.25 μm, 2. K/min, 230. C @ 60. min; Tstart: 50. C
CapillaryDB-Wax2846.Shiratsuchi, Shimoda, et al., 1994, 260. m/0.25 mm/0.25 μm, He, 2. K/min, 230. C @ 60. min; Tstart: 50. C

Normal alkane RI, polar column, temperature ramp

View large format table.

Column type Active phase I Reference Comment
CapillaryNB-3512834.Onocha, Ekundayo, et al., 199925. m/0.3 mm/0.5 μm, H2, 70. C @ 2. min, 5. K/min; Tend: 250. C

Lee's RI, non-polar column, temperature ramp

View large format table.

Column type Active phase I Reference Comment
CapillaryDB-1398.2Johnson, Urso, et al., 199730. m/0.2 mm/0.25 μm, 50. C @ 2. min, 5. K/min, 300. C @ 5. min
CapillaryDB-1398.2Johnson, Urso, et al., 199730. m/0.2 mm/0.25 μm, 50. C @ 2. min, 5. K/min, 300. C @ 5. min

References

Shiratsuchi, Shimoda, et al., 1994
Shiratsuchi, H.; Shimoda, M.; Imayoshi, K.; Noda, K.; Osajima, Y., Off-flavor compounds in spray-dried skim milk powder, J. Agric. Food Chem., 1994, 42, 6, 1323-1327, https://doi.org/10.1021/jf00042a014 . [all data]

Shiratsuchi, Shimoda, et al., 1994, 2
Shiratsuchi, H.; Shimoda, M.; Imayoshi, K.; Noda, K.; Osajima, Y., Volatile flavor compounds in spray-dried skim milk powder, J. Agric. Food Chem., 1994, 42, 4, 984-988, https://doi.org/10.1021/jf00040a028 . [all data]

Onocha, Ekundayo, et al., 1999
Onocha, P.A.; Ekundayo, O.; Oyelola, O.; Laakso, I., Essential oils of Dacryodes edulis (G. Don) H. J. Lam (African pear), Flavour Fragr. J., 1999, 14, 2, 135-139, https://doi.org/10.1002/(SICI)1099-1026(199903/04)14:2<135::AID-FFJ788>3.0.CO;2-L . [all data]

Johnson, Urso, et al., 1997
Johnson, C.I.; Urso, A.; Geleta, L., Broad spectrum analysis of municipal and industrial effluents discharged into the Peace, Athabasca and Slave river basins: characterization of effluent samples, 1994 - Volume 1 of 2, Northern River Basins Study Project Report No. 121, Norther River Basins Study, Edmonton, Alberta, 1997, 27. [all data]