1,1'-Azodiformamide
- Formula: C2H4N4O2
- Molecular weight: 116.0788
- IUPAC Standard InChIKey: XOZUGNYVDXMRKW-UHFFFAOYSA-N
- CAS Registry Number: 123-77-3
- Chemical structure:

Condensed phase thermochemistry data

Data compiled by: Hussein Y. Afeefy, Joel F. Liebman, and Stephen E. Stein
Quantity | Value | Units | Method | Reference | Comment |
---|---|---|---|---|---|
ΔfH°solid | -293. ± 2. | kJ/mol | Ccb | Williams, McEwan, et al., 1957 | |
Quantity | Value | Units | Method | Reference | Comment |
ΔcH°solid | -1069. | kJ/mol | Ccb | Reed, 1960 | |
ΔcH°solid | -1066. ± 2. | kJ/mol | Ccb | Williams, McEwan, et al., 1957 |

References

Williams, McEwan, et al., 1957
Williams, M.M.; McEwan, W.S.; Henry, R.A.,
The heats of combustion of substituted triazoles, tetrazoles and related high nitrogen compounds,
J. Phys. Chem., 1957, 61, 261-267. [all data]
Reed, 1960
Reed, R.A.,
New blowing agents for foaming plastics,
British Plastics, 1960, 33, 468-472. [all data]
Fantazier and Herwch, 1974
Fantazier, R.M.; Herwch, J.E.,
J. Am. Chem. Soc., 1974, 96, 1187. [all data]