Propanoic acid, anhydride
- Formula: C6H10O3
- Molecular weight: 130.1418
- IUPAC Standard InChIKey: WYVAMUWZEOHJOQ-UHFFFAOYSA-N
- CAS Registry Number: 123-62-6
- Chemical structure:
View 3d structure (requires JavaScript / HTML 5) - Other names: Methylacetic anhydride; Propanoic anhydride; Propionic acid anhydride; Propionic anhydride; Propionyl oxide; C2H5C(O)OC(O)C2H5; Anhydrid kyseliny propionove; UN 2496; Propanoic acid, 1,1'-anhydride

Phase change data

Data compiled as indicated in comments:
BS - Robert L. Brown and Stephen E. Stein
TRC - Thermodynamics Research Center, NIST Boulder Laboratories, Chris Muzny director
AC - William E. Acree, Jr., James S. Chickos
Quantity | Value | Units | Method | Reference | Comment |
---|---|---|---|---|---|
Tboil | 440. ± 20. | K | AVG | N/A | Average of 7 values; Individual data points |
Quantity | Value | Units | Method | Reference | Comment |
Tfus | 228.15 | K | N/A | Timmermans and Mattaar, 1921 | Uncertainty assigned by TRC = 0.5 K; TRC |
Reduced pressure boiling point
Tboil (K) | Pressure (bar) | Reference | Comment |
---|---|---|---|
340.7 | 0.024 | Weast and Grasselli, 1989 | BS |
Enthalpy of vaporization
ΔvapH (kJ/mol) | Temperature (K) | Method | Reference | Comment |
---|---|---|---|---|
48.2 | 308. | A | Stephenson and Malanowski, 1987 | Based on data from 293. to 440. K.; AC |
52.2 | 356. | N/A | Kahlbaum, 1883 | Based on data from 341. to 440. K.; AC |
Antoine Equation Parameters
log10(P) = A − (B / (T + C))
P = vapor pressure (bar)
T = temperature (K)
View plot Requires a JavaScript / HTML 5 canvas capable browser.
Temperature (K) | A | B | C | Reference | Comment |
---|---|---|---|---|---|
340.7 to 440. | 3.23076 | 949.198 | -145.898 | Kahlbaum, 1883 | Coefficents calculated by NIST from author's data. |

Reaction thermochemistry data

Data compiled by: Hussein Y. Afeefy, Joel F. Liebman, and Stephen E. Stein
Individual Reactions
By formula: C6H10O3 + H2O = 2C3H6O2
Quantity | Value | Units | Method | Reference | Comment |
---|---|---|---|---|---|
ΔrH° | -56.6 ± 0.4 | kJ/mol | Cm | Conn, Kistiakowsky, et al., 1942 | liquid phase; Heat of hydrolysis at 303 K |

References

Timmermans and Mattaar, 1921
Timmermans, J.; Mattaar, J.F.,
Freezing points of orgainic substances VI. New experimental determinations.,
Bull. Soc. Chim. Belg., 1921, 30, 213. [all data]
Weast and Grasselli, 1989
CRC Handbook of Data on Organic Compounds, 2nd Editon, Weast,R.C and Grasselli, J.G., ed(s)., CRC Press, Inc., Boca Raton, FL, 1989, 1. [all data]
Stephenson and Malanowski, 1987
Stephenson, Richard M.; Malanowski, Stanislaw,
Handbook of the Thermodynamics of Organic Compounds, 1987, https://doi.org/10.1007/978-94-009-3173-2
. [all data]
Kahlbaum, 1883
Kahlbaum, Georg W.A.,
Ueber die Abhängigkeit der Siedetemperatur vom Luftdruck,
Ber. Dtsch. Chem. Ges., 1883, 16, 2, 2476-2484, https://doi.org/10.1002/cber.188301602178
. [all data]
Conn, Kistiakowsky, et al., 1942
Conn, J.B.; Kistiakowsky, G.B.; Roberts, R.M.; Smith, E.A.,
Heats of organic reactions. XIII. Heats of hydrolysis of some acid anhydrides,
J. Am. Chem. Soc., 1942, 64, 1747-17. [all data]