1-Butanol, 3-methyl-
- Formula: C5H12O
- Molecular weight: 88.1482
- IUPAC Standard InChIKey: PHTQWCKDNZKARW-UHFFFAOYSA-N
- CAS Registry Number: 123-51-3
- Chemical structure:
View 3d structure (requires JavaScript / HTML 5) - Other names: Isopentyl alcohol; Fermentation amyl alcohol; Fusel Oil; Isoamyl alcohol; Isoamylol; Isobutyl carbinol; Isopentanol; 2-Methyl-4-butanol; 3-Methyl-1-butanol; 3-Methylbutanol; Alcool amilico; Alcool isoamylique; Amylowy alkohol; iso-amylalkohol; 3-Methylbutan-1-ol; 3-Metil-butanolo; Isoamyl alcohol, primary; Butanol, 3-methyl-; Butan-1-ol, 3-methyl; i-Amyl alcohol; Isopentan-1-ol; Methyl-3-butan-1-ol; NSC 1029; UN 1105; 3-methylbutanoI; Isoamyl alcohol (3-methyl butanol)

Gas phase thermochemistry data

Data compiled as indicated in comments:
DRB - Donald R. Burgess, Jr.
ALS - Hussein Y. Afeefy, Joel F. Liebman, and Stephen E. Stein
GT - Glushko Thermocenter, Russian Academy of Sciences, Moscow
Quantity | Value | Units | Method | Reference | Comment |
---|---|---|---|---|---|
ΔfH°gas | -300.8 | kJ/mol | N/A | Markovnik, Shvarko, et al., 1987 | Value computed using ΔfHliquid° value of -355.9±1.6 kj/mol from Markovnik, Shvarko, et al., 1987 and ΔvapH° value of 55.1 kj/mol from Chao and Rossini, 1965.; DRB |
ΔfH°gas | -301.3 ± 1.5 | kJ/mol | Ccb | Chao and Rossini, 1965 | Heat of formation derived by Cox and Pilcher, 1970; ALS |
Constant pressure heat capacity of gas
Cp,gas (J/mol*K) | Temperature (K) | Reference | Comment |
---|---|---|---|
187.2 ± 1.1 | 451.65 | Stromsoe E., 1970 | Ideal gas heat capacities are given by [ Stromsoe E., 1970] as a linear function Cp=f1*(a+bT). This expression approximates the experimental values with the average deviation of 1.09 J/mol*K. The accuracy of the experimental heat capacities [ Stromsoe E., 1970] is estimated as less than 0.3%.; GT |
193.7 ± 1.1 | 474.55 | ||
197.6 ± 1.1 | 488.35 | ||
200.7 ± 1.1 | 499.15 |

Condensed phase thermochemistry data

Data compiled as indicated in comments:
ALS - Hussein Y. Afeefy, Joel F. Liebman, and Stephen E. Stein
DH - Eugene S. Domalski and Elizabeth D. Hearing
Quantity | Value | Units | Method | Reference | Comment |
---|---|---|---|---|---|
ΔfH°liquid | -355.9 ± 1.6 | kJ/mol | Ccb | Markovnik, Shvarko, et al., 1987 | Uc =-3320.42 kJ/mol; ALS |
ΔfH°liquid | -356.4 ± 0.59 | kJ/mol | Ccb | Chao and Rossini, 1965 | ALS |
Quantity | Value | Units | Method | Reference | Comment |
ΔcH°liquid | -3326.6 ± 1.6 | kJ/mol | Ccb | Markovnik, Shvarko, et al., 1987 | Uc =-3320.42 kJ/mol; Corresponding ΔfHºliquid = -355.92 kJ/mol (simple calculation by NIST; no Washburn corrections); ALS |
ΔcH°liquid | -3326.2 ± 0.50 | kJ/mol | Ccb | Chao and Rossini, 1965 | Corresponding ΔfHºliquid = -356.4 kJ/mol (simple calculation by NIST; no Washburn corrections); ALS |
Constant pressure heat capacity of liquid
Cp,liquid (J/mol*K) | Temperature (K) | Reference | Comment |
---|---|---|---|
257.7 | 347. | Swietoslawski and Zielenkiewicz, 1958 | Mean value 22 to 126°C.; DH |
209.52 | 295.52 | Zhdanov, 1945 | T = 7 to 47°C. Value is unsmoothed experimental datum.; DH |
210.0 | 303. | Willams and Daniels, 1924 | T = 303 to 343 K. Equation only; DH |

Phase change data

Data compiled as indicated in comments:
TRC - Thermodynamics Research Center, NIST Boulder Laboratories, Chris Muzny director
BS - Robert L. Brown and Stephen E. Stein
AC - William E. Acree, Jr., James S. Chickos
ALS - Hussein Y. Afeefy, Joel F. Liebman, and Stephen E. Stein
DRB - Donald R. Burgess, Jr.
Quantity | Value | Units | Method | Reference | Comment |
---|---|---|---|---|---|
Tboil | 404. ± 2. | K | AVG | N/A | Average of 83 out of 84 values; Individual data points |
Quantity | Value | Units | Method | Reference | Comment |
Tc | 579. ± 3. | K | AVG | N/A | Average of 9 values; Individual data points |
Quantity | Value | Units | Method | Reference | Comment |
Pc | 39.3 ± 0.2 | bar | N/A | Gude and Teja, 1995 | |
Pc | 39.30 | bar | N/A | Quadri, Khilar, et al., 1991 | Uncertainty assigned by TRC = 0.40 bar; TRC |
Pc | 45.5963 | bar | N/A | Kreglewski, 1955 | Uncertainty assigned by TRC = 2.0265 bar; TRC |
Quantity | Value | Units | Method | Reference | Comment |
ΔvapH° | 53. ± 8. | kJ/mol | AVG | N/A | Average of 6 values; Individual data points |
Enthalpy of vaporization
ΔvapH (kJ/mol) | Temperature (K) | Method | Reference | Comment |
---|---|---|---|---|
44.07 | 404.2 | N/A | Majer and Svoboda, 1985 | |
49.8 | 363. | N/A | Lladosa, Monton, et al., 2008 | Based on data from 348. to 404. K.; AC |
47.2 | 340. | N/A | Aucejo, Burguet, et al., 1994 | Based on data from 325. to 385. K.; AC |
57.1 | 318. | N/A | Stephenson and Malanowski, 1987 | Based on data from 303. to 412. K.; AC |
55.2 ± 0.2 | 303. | C | Majer, Svoboda, et al., 1985 | AC |
54.2 ± 0.2 | 313. | C | Majer, Svoboda, et al., 1985 | AC |
52.9 ± 0.2 | 328. | C | Majer, Svoboda, et al., 1985 | AC |
51.4 ± 0.2 | 343. | C | Majer, Svoboda, et al., 1985 | AC |
49.7 ± 0.2 | 358. | C | Majer, Svoboda, et al., 1985 | AC |
56.5 | 313. | N/A | Wilhoit and Zwolinski, 1973 | Based on data from 298. to 426. K.; AC |
Enthalpy of vaporization
ΔvapH = A exp(-αTr)
(1 − Tr)β
ΔvapH =
Enthalpy of vaporization (at saturation pressure)
(kJ/mol)
Tr = reduced temperature (T / Tc)
View plot Requires a JavaScript / HTML 5 canvas capable browser.
Temperature (K) | 303. to 395. |
---|---|
A (kJ/mol) | 68.92 |
α | -0.598 |
β | 0.7228 |
Tc (K) | 579.4 |
Reference | Majer and Svoboda, 1985 |

Gas phase ion energetics data

Data compiled by: John E. Bartmess
De-protonation reactions
C5H11O- + =
By formula: C5H11O- + H+ = C5H12O
Quantity | Value | Units | Method | Reference | Comment |
---|---|---|---|---|---|
ΔrH° | 1566. ± 8.4 | kJ/mol | CIDC | Haas and Harrison, 1993 | gas phase; Both metastable and 50 eV collision energy. |
ΔrH° | 1563. ± 12. | kJ/mol | G+TS | Boand, Houriet, et al., 1983 | gas phase; value altered from reference due to change in acidity scale |
Quantity | Value | Units | Method | Reference | Comment |
ΔrG° | 1538. ± 8.8 | kJ/mol | H-TS | Haas and Harrison, 1993 | gas phase; Both metastable and 50 eV collision energy. |
ΔrG° | 1535. ± 11. | kJ/mol | CIDC | Boand, Houriet, et al., 1983 | gas phase; value altered from reference due to change in acidity scale |

Normal alkane RI, polar column, custom temperature program

Data compiled by: NIST Mass Spectrometry Data Center, William E. Wallace, director

Column type CapillaryCapillaryCapillaryCapillaryCapillary
Active phase DB-WaxCarbowax 20MDB-WaxDB-WaxDB-Wax
Column length (m) 60. 30.30.30.
Carrier gas Helium HeliumHeliumHelium
Substrate
Column diameter (mm) 0.20 0.250.250.25
Phase thickness (μm) 0.25 0.250.250.25
Program 40 0C (3 min) 2 0C/min -> 150 0C 4 0C/min -> 220 0C (20 min) 5 0C/min -> 230 0Cnot specifiednot specifiednot specifiednot specified
I 1207.1215.1200.1206.1208.
ReferenceGyawali and Kim, 2012Lee, Chong, et al., 2012Welke, Manfroi, et al., 2012Welke, Manfroi, et al., 2012Welke, Manfroi, et al., 2012
Comment MSDC-RI MSDC-RI MSDC-RI MSDC-RI MSDC-RI
Column type CapillaryCapillaryCapillaryCapillaryCapillary
Active phase HP-InnowaxDB-WaxCP-Wax 52 CBDB-WaxHP-Innowax
Column length (m) 60.60. 30.60.
Carrier gas HeliumHelium HydrogenHelium
Substrate
Column diameter (mm) 0.250.25 0.250.25
Phase thickness (μm) 0.250.50 0.250.25
Program not specified40 0C 4 0C/min -> 230 0C 100 0C/min -> 260 0C (11.7 min)not specified35 0C (9 min) 5 0C/min -> 80 0C 1 0C/min -> 100 0C 16 0C/min -> 210 0C (20 min)40 0C (2 min) 3 0C/min -> 150 0C 5 0C/min -> 220 0C (5 min)
I 1208.1164.1215.1226.1213.
ReferenceFeng, Zhuang, et al., 2011Miyazaki, Plotto, et al., 2011Povolo, Cabassi, et al., 2011Sampaio, Garruti, et al., 2011Xiao, Dai, et al., 2011
Comment MSDC-RI MSDC-RI MSDC-RI MSDC-RI MSDC-RI
Column type CapillaryCapillaryCapillaryCapillaryCapillary
Active phase FFAPHP-InnowaxDB-WaxFFAPStabilwax
Column length (m) 25.30.30.25.30.
Carrier gas NitrogenHeliumHydrogenNitrogenHelium
Substrate
Column diameter (mm) 0.320.250.320.320.25
Phase thickness (μm) 0.300.250.500.300.25
Program 36 0C 20 0C/min -> 85 0C 1 0C/min -> 145 0C 3 0C/min -> 250 0C45 0C (1 min) 5 oC/min -> 170 0C 10 0C/min -> 260 0C (1 min)40 0C (5 min) 4 0C/min -> 100 0C 6 0C/min -> 220 0C (20 min)36 0C 20 0C/min -> 85 0C 1 0C -> 145 0C 3 0C/min -> 230 0C35 0C 3 0C/min -> 100 0C 5 0C/min -> 240 0C (10 min)
I 1217.1215.1217.1217.1208.
ReferenceBailly and Collin, 2010Cajka, Riddellova, et al., 2010San-Juan, Petka, et al., 2010Bailly, Jerkovic, et al., 2009Chinnici, Guerrero, et al., 2009
Comment MSDC-RI MSDC-RI MSDC-RI MSDC-RI MSDC-RI
Column type CapillaryCapillaryCapillaryCapillaryCapillary
Active phase DB-WaxDB-WaxSupelcowax-10DB-WaxDB-Wax
Column length (m) 30.60.50.30.60.
Carrier gas  HeliumHeliumHeliumHelium
Substrate
Column diameter (mm) 0.320.250.250.250.32
Phase thickness (μm) 0.500.250.250.250.25
Program 40 0C (5 min) 4 0C/min -> 100 0C 6 0C/min -> 220 0C (40 min)40 0C (3 min) 2 0C/min -> 150 0C 4 0C/min -> 220 0C (20 min)45 0C (15 min) 3 0C/min -> 75 0C 5 0C/min -> 180 0C (10 min)not specifiednot specified
I 1217.1211.1210.1208.1190.
ReferenceFerreira, Juan, et al., 2009Gyawali and Kim, 2009Soria, Martinez-Castro, et al., 2009Zhao, Xu, et al., 2009Beck, Higbee, et al., 2008
Comment MSDC-RI MSDC-RI MSDC-RI MSDC-RI MSDC-RI
Column type CapillaryCapillaryCapillaryCapillaryCapillary
Active phase FFAPCP-Wax 52 CBDB-WaxSupelcowax 10Supelcowax 10
Column length (m)  50.30.50.50.
Carrier gas HeliumHeliumHeliumHeliumHelium
Substrate
Column diameter (mm)  0.250.320.250.25
Phase thickness (μm)  0.290.250.250.25
Program not specified33 0C (1 min) 2 0C/min -> 130 0C 10 0C/min -> 220 0C40 0C (3 min) 4 0C/min -> 160 0C 7 0C/min -> 220 0C (8 min)45 0C (15 min) 3 0C/min -> 75 0C 5 0C/min -> 180 0C (10 min)45 0C (15 min) 3 0C/min -> 75 0C 5 0C/min -> 180 0C (10 min)
I 1185.1191.1230.1210.1210.
ReferenceFrauendorfer and Schieberle, 2008Kaack and Christensen, 2008Li, Tao, et al., 2008Soria, Martinez-Castro, et al., 2008Soria, Martinez-Castro, et al., 2008
Comment MSDC-RI MSDC-RI MSDC-RI MSDC-RI MSDC-RI
Column type CapillaryCapillaryCapillaryCapillaryCapillary
Active phase DB-WaxDB-WaxPEG 20MSupelcowax-10Supelcowax-10
Column length (m) 30.30.30.30.30.
Carrier gas HeliumHeliumHeliumHeHe
Substrate
Column diameter (mm) 0.320.320.250.250.25
Phase thickness (μm) 0.250.250.250.250.25
Program 50 0C 20 0C/min -> 80 0C 3 0C/min -> 230 0C40 0C (4 min) 3 0C/min -> 50 0C 5 0C/min -> 120 0C 7 0C/min -> 175 0C 10 0C/min -> 230 0C (8 min)40 0C (3 min) 5 0C/min -> 60 0C 6 0C/min -> 130 0C 10 0C/min -> 230 0C35C(8min) => 6C/min => 60C => 4C/min => 160C => 20C/min => 200C(1min)35C(8min) => 6C/min => 60C => 4C/min => 160C => 20C/min => 200C(1min)
I 1229.1230.1205.1215.1222.
ReferenceTao, Wenlai, et al., 2008Yongsheng, Hua, et al., 2008Zhang, Zhang, et al., 2008Berard, Bianchi, et al., 2007Berard, Bianchi, et al., 2007
Comment MSDC-RI MSDC-RI MSDC-RI MSDC-RI MSDC-RI
Column type CapillaryCapillaryCapillaryCapillaryCapillary
Active phase Supelcowax-10DB-WaxDB-WaxDB-FFAPDB-Wax
Column length (m) 30.30.30.30.30.
Carrier gas HeHydrogenHydrogen He
Substrate
Column diameter (mm) 0.250.250.250.320.32
Phase thickness (μm) 0.250.250.250.250.25
Program 40C(10min) => 2C/min => 200C(1min) => 2C/min => 250C (10min)44 0C 3 0C/min -> 170 0C 8 0C/min -> 250 0Cnot specified35C(2min) => 40C/min => 50C(2min) => 6C/min => 180C => 10C/min => 230C(10min)40C(3min) => 4C/min => 160C => 7C/min => 230C (8min)
I 1210.1205.1205.1213.1230.
ReferenceBosch-Fuste, Riu-Aumatell, et al., 2007Gonzalez-Rios, Suarez-Quiroz, et al., 2007Gonzalez-Rios, Suarez-Quiroz, et al., 2007Lasekan, Buettner, et al., 2007Li, Tao, et al., 2007
Comment MSDC-RI MSDC-RI MSDC-RI MSDC-RI MSDC-RI
Column type CapillaryCapillaryCapillaryCapillaryCapillary
Active phase BP-20DB-WaxDB-WaxInnowax FSCDB-Wax
Column length (m) 30.30.30.60.30.
Carrier gas HeHydrogenHydrogenHeHe
Substrate
Column diameter (mm) 0.250.320.320.250.25
Phase thickness (μm) 0.250.500.500.250.25
Program 50C(1min) => 2.5C/min => 100C => 2C/min => 180C => 15C/min => 220C60 0C (3 min) 2 0C/min -> 220 0C 3 0C/min -> 245 0C (20 min)60 0C (3 min) 2 0C/min -> 220 0C 3 0C/min -> 245 0C (20 min)60C(10min) => 4C/min => 220C (10min) => 1C/min => 240C50 0C (2 min) 6 0C/min -> 150 0C 8 0C/min -> 230 0C (15 min)
I 1212.1250.1223.1213.1203.
ReferencePontes, Marques, et al., 2007Selli, 2007Selli, 2007Tabanca, Demirci, et al., 2007Tian, Zhang, et al., 2007
Comment MSDC-RI MSDC-RI MSDC-RI MSDC-RI MSDC-RI
Column type CapillaryCapillaryCapillaryCapillaryCapillary
Active phase Supelcowax-10HP-InnowaxPEG-20MFFAP-CBFFAP
Column length (m) 30.30.30.25.25.
Carrier gas HeHe HeliumHe
Substrate
Column diameter (mm) 0.250.250.250.320.32
Phase thickness (μm) 0.250.50.250.300.3
Program 40C(3min) => 4C/min => 75C => 8C/min => 250C(5min)30C(2min) => 4C/min => 130C => 8C/min => 250C(5min)40C(3min) => 5C/min => 60C => 6C/min => 130C => 10C/min => 230C (10min)36 0C 20 0C/min -> 85 0C 1 0C/min -> 1345 0C 3 0C/min -> 250 0C36C => 20C/min => 85C => 1C/min => 145C => 3C/min => 250C
I 1215.1216.1205.1217.1217.
ReferenceVichi, Guadayol, et al., 2007Weldegergis B.T., Tredoux A.G.J., et al., 2007Zhang C., Zhang H., et al., 2007Bailly, Jerkovic, et al., 2006Bailly, Jerkovic, et al., 2006, 2
Comment MSDC-RI MSDC-RI MSDC-RI MSDC-RI MSDC-RI
Column type CapillaryCapillaryCapillaryCapillaryCapillary
Active phase Supelcowax-10Carbowax 20MCarbowax 20MInnowax FSCInnowax FSC
Column length (m) 30.  60.60.
Carrier gas    HeHe
Substrate
Column diameter (mm) 0.25  0.250.25
Phase thickness (μm) 0.25  0.250.25
Program not specifiednot specifiednot specified60C(10min) => 4C/min => 220C(10min) => 1C/min => 240C60C(10min) => 4C/min => 220C(10min) => 1C/min => 240C
I 1211.1194.1196.1212.1212.
ReferenceRiu-Aumatell, Bosch-Fuste´, et al., 2006Editorial paper, 2005Editorial paper, 2005Baser, Özek, et al., 2004Baser, Özek, et al., 2004
Comment MSDC-RI MSDC-RI MSDC-RI MSDC-RI MSDC-RI
Column type CapillaryCapillaryCapillaryCapillaryCapillary
Active phase DB-FFAPDB-WaxDB-WaxDB-WaxInnowax
Column length (m) 30. 60.30.60.
Carrier gas He HeliumHeHe
Substrate
Column diameter (mm) 0.32 0.250.320.25
Phase thickness (μm) 0.25 0.250.50.25
Program 40C(2min) => 40C/min => 60C(2min) => 6C/min => 180C => 15C/min => 230C (10min)not specified60 0C (3 min) 2 0C/min -> 150 0C 4 0C/min -> 200 0C40C => 1C/min => 57C => 15C/min => 230C (5min)50C(10min) => 4C/min => 220C(10min) => 1C/min => 240C
I 1211.1229.1205.1229.1212.
ReferenceBuettner, 2004Escudero, Gogorza, et al., 2004Kim. J.H., Ahn, et al., 2004le Pape, Grua-Priol, et al., 2004Selli, Kürkçüoglu, et al., 2004
Comment MSDC-RI MSDC-RI MSDC-RI MSDC-RI MSDC-RI
Column type CapillaryCapillaryCapillaryCapillaryCapillary
Active phase Carbowax 20MCarbowax 20MHP-Innowax FSCPEG-20MCP-WAX 57CB
Column length (m)   60.30.50.
Carrier gas   He He
Substrate
Column diameter (mm)   0.250.250.25
Phase thickness (μm)   0.250.250.2
Program not specifiednot specified60C (10min) => 4C/min => 220C (10min) => 1C/min => 240C50C(8min) => 4C/min => 110C => 16C/min => 200C40C(10min) => 5C/min => 100C => 3C/min => 180C => 20C/min => 210C (10min)
I 1203.1184.1212.1237.1229.
ReferenceVinogradov, 2004Vinogradov, 2004Demirci, Baser, et al., 2003Garruti, Franco, et al., 2003Martí, Mestres, et al., 2003
Comment MSDC-RI MSDC-RI MSDC-RI MSDC-RI MSDC-RI
Column type CapillaryCapillaryCapillaryCapillaryCapillary
Active phase DB-WaxDB-WaxInnowaxInnowaxFFAP
Column length (m) 60.30.60.60.30.
Carrier gas HeHeHeHeHelium
Substrate
Column diameter (mm) 0.320.320.250.250.32
Phase thickness (μm) 0.50.50.250.250.25
Program 35C(4min) => 2C/min => 130C => 4C/min => 250C60C(2min) => 2C/min => 220C => 3C/min => 245C(20min)60C(10min) => 4C/min => 220C(10min) => 1C/min => 240C (20min)60C(10min) => 4C/min => 220C(10min) => 1C/min => 240C50 0C (2 min) 6 0C/min -> 180 0C 10 0C/min -> 180 0C (10 min)
I 1169.1210.1221.1221.1201.
ReferenceQian and Reineccius, 2003Selli, Cabaroglu, et al., 2003Tunaher, Kirimer, et al., 2003Baser, Nuriddinov, et al., 2002Bel Rhild, Fleury, et al., 2002
Comment MSDC-RI MSDC-RI MSDC-RI MSDC-RI MSDC-RI
Column type CapillaryCapillaryCapillaryCapillaryCapillary
Active phase FFAPFFAPCP-Wax 52CBSupelcowax-10TRWAX
Column length (m) 30.30.30.60.60.
Carrier gas HeliumHeliumHeHeHe
Substrate
Column diameter (mm) 0.320.320.250.250.25
Phase thickness (μm) 0.250.250.250.250.25
Program 50 0C (2 min) 6 0C/min -> 180 0C 10 0C/min -> 180 0C (10 min)50 0C (2 min) 6 oC/min -> 180 0C 10 0C/min -> 240 0C (10 min)50C(5min) => 7C/min => 180C => 10C/min => 240C(10min)40C(20min) => (1.5C/min) => 200C => (10C/min) => 250C(120min)not specified
I 1203.1201.1201.1182.1226.
ReferenceBel Rhild, Fleury, et al., 2002Bel Rhild, Fleury, et al., 2002, 2Escalona, Birkmyre, et al., 2002Rogerson and de Freitas, 2002Torrens, 2002
Comment MSDC-RI MSDC-RI MSDC-RI MSDC-RI MSDC-RI
Column type CapillaryCapillaryCapillaryCapillaryCapillary
Active phase FFAPCP-Wax 52CBHP-InnowaxNukolDB-Wax
Column length (m) 30.30.60.25.30.
Carrier gas HeHeHeN2He
Substrate
Column diameter (mm) 0.320.250.250.250.25
Phase thickness (μm) 0.250.250.25 0.25
Program 35C (2min) => 40C/min => 60C (2min) => 6C/min => 180C => 10C/min => 230C (10min)50C(5min) => 7C/min => 180C => 10C/min => 240C(10min)60 0C (10 min) 4 K/min -> 220 0C (10 min) 1 K/min -> 240 0C45C(5min) => 20C/min => 100C(1min) => 3C/min => 190C(40min)25 0C (0.5 min) 50 K/min -> 50 0C 3.5 K/min -> 150 0C 7.5 K/min -> 240 0C
I 1211.1204.1212.1197.1184.
ReferenceBuettner and Schieberle, 2001Escalona, Birkmyre, et al., 2001Gören, Demirci, et al., 2001López and Dufour, 2001Miranda, Nogueira, et al., 2001
Comment MSDC-RI MSDC-RI MSDC-RI MSDC-RI MSDC-RI
Column type CapillaryCapillaryCapillaryCapillaryCapillary
Active phase HP-InnowaxCP-Wax 52CBPEGCarbowax 20MDB-FFAP
Column length (m) 60.50.40. 30.
Carrier gas HeHeHydrogen
Substrate
Column diameter (mm) 0.250.250.182 0.32
Phase thickness (μm) 0.250.20.30 0.25
Program 60C(10min) => 4C/min => 220C(10min) => 1C/min => 240C30C (1.5min) => 3C/min => 120C => 10C/min => 220C (3.5min)35 0C (5 min) 5 0C/min -> 100 0C 3 0C/min -> 200 0C (1 min) 20 0C/min -> 240 0C (2 min)not specified35C (1min) => 40C/min => 60C (1min) => 6C/min => 250C (10min)
I 1212.1199.1223.1180.1220.
ReferenceTabanca, Kirimer, et al., 2001Jakobsen, Hansen, et al., 1998Vas, Gal, et al., 1998Vernin, Lageot, et al., 1998Guth, 1997
Comment MSDC-RI MSDC-RI MSDC-RI MSDC-RI MSDC-RI
Column type CapillaryCapillaryCapillaryCapillaryCapillary
Active phase DB-FFAPCP-Wax 52 CBSupelcowax-10Supelcowax-10Supelcowax-10
Column length (m) 30.30.30.30.30.
Carrier gas  H2HeHe
Substrate
Column diameter (mm) 0.320.320.320.320.53
Phase thickness (μm) 0.25 0.25 0.25
Program 35C (1min) => 40C/min => 60C (1min) => 6C/min => 250C (10min)60 0C 2 0C/min -> 220 0C 3 0C/min -> 245 0C50C(2min) => 7C/min => 140C => 17.5C/min => 230C35C => 40C/min => 60C(2min) => 4C/min => 240C80C(5min) => 5C/min => 155C => 4C/min => 240C(30min)
I 1220.1222.1184.1195.1209.
ReferenceGuth, 1997Carro Marino, López Tamames, et al., 1995Chang, Seitz, et al., 1995Schieberle and Grosch, 1994Miranda-Lopez, Libbey, et al., 1992
Comment MSDC-RI MSDC-RI MSDC-RI MSDC-RI MSDC-RI
Column type CapillaryCapillaryCapillaryCapillaryCapillary
Active phase DB-WaxDB-WaxCarbowax 20MCarbowax 20MCarbowax 400, Carbowax 20M, Carbowax 1540, Carbowax 4000, Superox 06, PEG 20M, etc.
Column length (m)  60.  50.
Carrier gas   He Hydrogen
Substrate
Column diameter (mm)  0.32  0.32
Phase thickness (μm)
Program not specifiednot specifiednot specifiednot specifiednot specified
I 1231.1205.1190.1184.1174.
ReferencePeng, Yang, et al., 1991Binder, Flath, et al., 1989Peppard and Ramus, 1988Shibamoto, 1987Waggott and Davies, 1984
Comment MSDC-RI MSDC-RI MSDC-RI MSDC-RI MSDC-RI
Column type CapillaryCapillaryCapillaryCapillaryCapillary
Active phase Carbowax 400, Carbowax 20M, Carbowax 1540, Carbowax 4000, Superox 06, PEG 20M, etc.Carbowax 20MCarbowax 20MCarbowax 20MPolyethylene Glycol
Column length (m) 50.60.60.
Carrier gas HydrogenHeHe
Substrate
Column diameter (mm) 0.320.250.25
Phase thickness (μm)
Program not specifiednot specifiednot specifiednot specifiednot specified
I 1240.1189.1218.1159.1184.
ReferenceWaggott and Davies, 1984Fagan, Kepner, et al., 1982Fagan, Kepner, et al., 1982Ramsey and Flanagan, 1982MacLeod and Pieris, 1981
Comment MSDC-RI MSDC-RI MSDC-RI MSDC-RI MSDC-RI

Van Den Dool and Kratz RI, polar column, custom temperature program

Data compiled by: NIST Mass Spectrometry Data Center, William E. Wallace, director

Column type CapillaryCapillaryCapillaryCapillaryCapillary
Active phase Supelcowax-10Supelcowax-10Supelcowax-10Supelcowax-10Supelcowax-10
Column length (m) 30.30.30.30.30.
Carrier gas  HeHeHeHe
Substrate
Column diameter (mm) 0.250.250.250.250.25
Phase thickness (μm) 0.250.250.250.250.25
Program 35C(8min) => 4C/min => 60C => 6C/min => 160C => 20C/min => 220C(1min)35C(8min) => 4C/min => 60C => 6C/min => 160C => 20C/min => 200C(1min)35C(8min) => 4C/min => 60C => 6C/min => 160C => 20C/min => 200C(1min)35C(8min) => 4C/min => 60C => 6C/min => 160C => 20C/min => 200C(1min)35C(8min) => 4C/min => 60C => 6C/min => 160C => 20C/min => 200C(1min)
I 1221.1215.1222.1221.1221.
ReferenceBianchi, Cantoni, et al., 2007Bianchi, Careri, et al., 2007Bianchi, Careri, et al., 2007Bianchi, Careri, et al., 2007Bianchi, Careri, et al., 2007
Comment MSDC-RI MSDC-RI MSDC-RI MSDC-RI MSDC-RI
Column type CapillaryCapillaryCapillaryCapillaryCapillary
Active phase DB-WaxDB-WaxDB-WaxDB-WaxSOLGel-Wax
Column length (m) 30.30.30.30.30.
Carrier gas H2HeH2H2He
Substrate
Column diameter (mm) 0.320.250.320.320.25
Phase thickness (μm) 0.50.50.50.50.25
Program 40C(5min) => 4C/min => 100C6C/min => 136C => 3C/min => 220C (10min)40C => 5C/min => 60C(30min) => 5C/min => 240C60C(3min) => 2C/min => 220C => 3C/min => 245C (20min)60C(3min) => 2C/min => 220C => 3C/min => 245C(20min)35C(5min) => 3C/min => 150C => 5C/min => 250C (10min)
I 1224.1225.1210.1210.1182.
ReferenceEscudero, Campo, et al., 2007Mehinagic, Royer, et al., 2006Selli, Canbas, et al., 2006Selli, Canbas, et al., 2006, 2Aubert, Baumann, et al., 2005
Comment MSDC-RI MSDC-RI MSDC-RI MSDC-RI MSDC-RI
Column type CapillaryCapillaryCapillaryCapillaryCapillary
Active phase DB-WaxFFAPSupelcowax-10CP-Wax 52CBStabilwax
Column length (m) 30.30.30.50.30.
Carrier gas H2HeHeHeHe
Substrate
Column diameter (mm) 0.320.320.250.250.32
Phase thickness (μm) 0.50.250.250.21.
Program 40C(5min) => 4C/min => 100C => 6C/min => 200C35C(2min) => 40C/min => 60C(2min) => 6C/min => 180C => 20C/min => 230C(10min)35C(8min) => 3C/min => 134C => 20C/min => 250C(3.2min)33C(1.5min) => 1.5C/min => 60C(4min) => 2C/min => 100C => 8C/min => 220C(15min)40C(2min) => 5C/min => 100C => 4C/min => 230C (10min)
I 1225.1204.1206.1191.1218.
ReferenceCampo, Ferreira, et al., 2005Fritsch and Schieberle, 2005Howard, Mike, et al., 2005Kaack, Christensen, et al., 2005Wang, Finn, et al., 2005
Comment MSDC-RI MSDC-RI MSDC-RI MSDC-RI MSDC-RI
Column type CapillaryCapillaryCapillaryCapillaryCapillary
Active phase StabilwaxDB-WaxDB-WaxCP-Wax 52CBCarbowax 20M
Column length (m) 30.60.30.60.25.
Carrier gas HeHeH2HeH2
Substrate
Column diameter (mm) 0.320.250.320.250.32
Phase thickness (μm) 1.0.250.50.250.25
Program 40C(2min) => 5C/min => 100C => 4C/min => 230C (10min)35C(0.7min) => 20C/min => 70C => 4C/min => 240C60C(3min) => 2C/min => 220C => 3C/min => 245C (20min)40C => 5C/min => 60C => 2.5C/min => 155C40C (8min) => 3C/min => 180C => 20C/min => 230C
I 1237.1193.1210.1198.1221.
ReferenceWang, Finn, et al., 2005Ferrari, Lablanquie, et al., 2004Selli, Cabaroglu, et al., 2004Alasalvar, Shahidi, et al., 2003Boido, Lloret, et al., 2003
Comment MSDC-RI MSDC-RI MSDC-RI MSDC-RI MSDC-RI
Column type CapillaryCapillaryCapillaryCapillaryCapillary
Active phase DB-FFAPDB-WaxDB-WaxSupelcowax-10Supelcowax-10
Column length (m) 30.30.30.30.30.
Carrier gas  HeHe
Substrate
Column diameter (mm) 0.320.250.320.320.32
Phase thickness (μm) 0.250.50.50.30.3
Program 35C(2min) => 6C/min => 180C => 10C/min => 240C (10min)40C(2min) => 2C/min => 100C => 10C/min => 230C (5min)50C => 6C/min => 70C => 4C/min => 150C => 10C/min => 250C60C(8min) => 8C/min => 170C => 13C/min => 240C(20min)60C(8min) => 8C/min => 170C => 13C/min => 240C(20min)
I 1204.1221.1250.1211.1211.
ReferenceHuynh-Ba, Matthey-Doret, et al., 2003Klesk and Qian, 2003Pennarun, Prost, et al., 2003da Porto, Pizzale, et al., 2003da Porto, Pizzale, et al., 2003
Comment MSDC-RI MSDC-RI MSDC-RI MSDC-RI MSDC-RI
Column type CapillaryCapillaryCapillaryCapillaryCapillary
Active phase FFAPDB-WaxFFAPFFAPDB-Wax
Column length (m) 30.30.30.30.30.
Carrier gas HeH2  H2
Substrate
Column diameter (mm) 0.320.320.320.320.25
Phase thickness (μm) 0.250.50.250.250.25
Program 35C (2min) => 60C/min => 50C (2min) => 6C/min => 240C (10min)60C (3min) => 2C/min => 220C => 3C/min => 245C (20min)50C (2min) => 6C/min => 180C => 10C/min => 240C(10min)50C (2min) => 6C/min => 180C => 10C/min => 240C(10min)60C (3min) => 2C/min => 220C => 5C/min => 250C (15min)
I 1200.1209.1203.1201.1213.
ReferenceKirchhoff and Schieberle, 2002Nurgel, Erten, et al., 2002Rhlid, Fleury, et al., 2002Rhlid, Fleury, et al., 2002Boulanger and Crouzet, 2001
Comment MSDC-RI MSDC-RI MSDC-RI MSDC-RI MSDC-RI
Column type CapillaryCapillaryCapillaryCapillaryCapillary
Active phase DB-WaxDB-WaxFFAPInnowaxDB-Wax
Column length (m) 30.30.30.60.30.
Carrier gas H2 HeHe
Substrate
Column diameter (mm) 0.250.250.320.220.25
Phase thickness (μm) 0.250.250.250.250.25
Program 60C (3min) => 2C/min => 220C => 5C/min => 250C (15min)20C(30s) => fast => 60C => 4C/min => 220C (20min)40C(2min) => 40C/min => 60C(2min) => 6C/min => 240C(10min)35C (1min) => 3C/min => 170C => 4C/min => 200C (20min)30C(8min) => 4C/min => 60C => 6C/min => 160C => 20C/min => 200C(1min)
I 1212.1200.1200.1214.1237.
ReferenceBoulanger and Crouzet, 2001Cantergiani, Brevard, et al., 2001Kirchhoff and Schieberle, 2001Larráyoz, Addis, et al., 2001Radovic, Careri, et al., 2001
Comment MSDC-RI MSDC-RI MSDC-RI MSDC-RI MSDC-RI
Column type CapillaryCapillaryCapillaryCapillaryCapillary
Active phase DB-WaxDB-WaxFFAPDB-WaxSupelcowax-10
Column length (m) 30.30.30.50.60.
Carrier gas H2H2HeHeHe
Substrate
Column diameter (mm) 0.250.250.320.320.25
Phase thickness (μm) 0.250.250.25 0.25
Program 60 0C (3 min) 2 K/min -> 220 0C 5 K/min -> 250 0C (15 min)60C(3min) => 2C/min => 220C => 5C/min => 250C (15min)35C (2min) => 40C/min => 60C (2min) => 6C/min => 180C => 10C/min => 230C (10min)50C => 2.5C/min => 150C => 1.5C/min => 210C20C(0.5min) => 60C => 4C/min => 250C
I 1210.1215.1211.1229.61199.
ReferenceBoulanger and Crouzet, 2000Boulanger and Crouzet, 2000, 2Buettner and Schieberle, 1999Yang, Chyau, et al., 1998Sing, Smadja, et al., 1992
Comment MSDC-RI MSDC-RI MSDC-RI MSDC-RI MSDC-RI
Column type CapillaryCapillary
Active phase FFAPCarbowax 20M
Column length (m) 50.150.
Carrier gas He
Substrate
Column diameter (mm) 0.250.75
Phase thickness (μm) 0.25
Program 20C (5min) => 2C/min => 70C => 4C/min => 210Cnot specified
I 1197.1210.
ReferenceYasuhara, 1987Whitfield, Shea, et al., 1981
Comment MSDC-RI MSDC-RI

Van Den Dool and Kratz RI, non-polar column, custom temperature program

Data compiled by: NIST Mass Spectrometry Data Center, William E. Wallace, director

Column type CapillaryCapillaryCapillaryCapillaryCapillary
Active phase HP-5MSDB-5VF-5MSDB-5SE-54
Column length (m) 30.30.30.30.30.
Carrier gas HeHeHe He
Substrate
Column diameter (mm) 0.250.250.250.250.32
Phase thickness (μm) 0.250.250.250.250.25
Program 60C (1 min) => 5 C/min => 210C => 10 C/min => 280C (15 min)40C(2min) => 4C/min => 220C => 20C/min => 280CMulti-step temperature program; T(initial)=60C; T(final)=270C40C(2min) => 4C/min => 220C => 20C/min => 280C35C(2min) => 40C/min => 50C(2min) => 6C/min => 180C => 20C/min => 230C(10min)
I 760.747.734.1747.732.
ReferenceAndriamaharavo, 2014Andrade, Sampaio, et al., 2007Tret'yakov, 2007Sampaio and Nogueira, 2006Fritsch and Schieberle, 2005
Comment MSDC-RI MSDC-RI MSDC-RI MSDC-RI MSDC-RI
Column type CapillaryCapillaryCapillaryCapillaryCapillary
Active phase SE-54DB-1DB-5CP Sil 8 CBDB-5
Column length (m) 30.60.25.60.30.
Carrier gas HeHeHeHeHe
Substrate
Column diameter (mm) 0.320.320.320.250.25
Phase thickness (μm) 0.251.0.250.250.25
Program 35C(2min) => 40C/min => 50C(2min) => 6C/min => 180C => 20C/min => 230C(10min)35C(5min) => 10C/min => 45C (5min) => 5C/min => 250C (10min)35C (2min) => 40C/min => 50C (2min) => 4C/min => 240C (10min)0C => rapidly => 40C(8min) => 4C/min => 250C(10min)50C (1min) => 5C/min => 100C => 10C/min => 250C (9min)
I 740.721.732.748.733.
ReferenceFritsch and Schieberle, 2005Place, Imhof, et al., 2003Kirchhoff and Schieberle, 2002Oruna-Concha, Bakker, et al., 2002Beaulieu and Grimm, 2001
Comment MSDC-RI MSDC-RI MSDC-RI MSDC-RI MSDC-RI
Column type CapillaryCapillaryCapillaryCapillaryCapillary
Active phase DB-5MSDB-5MSDB-5DB-5MSDB-5MS
Column length (m) 30.30.25.30.30.
Carrier gas H2H2HeHeH2/N2
Substrate
Column diameter (mm) 0.250.250.320.250.25
Phase thickness (μm) 0.250.250.250.250.25
Program 40C (5min) => 2C/min => 200C => 5C/min => 250C (15min)40C (5min) => 2C/min => 200C => 5C/min => 250C (15min)35C(2min) => 40C/min => 50C(2min) => 4C/min => 240C(10min)60 0C (3 min) 2 K/min -> 220 0C 5 K/min -> 250 0C (15 min)40C (5min) => 2C/min => 200C => 5C/min => 250C (15min)
I 726.726.732.737.729.
ReferenceBoulanger and Crouzet, 2001Boulanger and Crouzet, 2001Kirchhoff and Schieberle, 2001Boulanger and Crouzet, 2000Boulanger and Crouzet, 2000, 2
Comment MSDC-RI MSDC-RI MSDC-RI MSDC-RI MSDC-RI
Column type CapillaryCapillaryCapillaryCapillaryCapillary
Active phase DB-5DB-5DB-5DB-5SE-54
Column length (m) 30.30.30.30.30.
Carrier gas H2H2H2H2He
Substrate
Column diameter (mm) 0.250.250.250.250.32
Phase thickness (μm) 0.250.250.250.250.25
Program 40C(5min) => 2C/min => 220C => 5C/min => 250C(15min)40C(5min) => 2C/min => 220C => 5C/min => 250C(15min)40C(5min) => 2C/min => 220C => 5C/min => 250C(15min)40C(5min) => 2C/min => 220C => 5C/min => 250C(15min)35C (2min) => 40C/min => 50C (2min) => 6C/min => 180C => 10C/min => 230C (10min)
I 726.734.726.734.739.
ReferenceBoulanger, Chassagne, et al., 1999Boulanger, Chassagne, et al., 1999Boulanger, Chassagne, et al., 1999Boulanger, Chassagne, et al., 1999Buettner and Schieberle, 1999
Comment MSDC-RI MSDC-RI MSDC-RI MSDC-RI MSDC-RI
Column type CapillaryCapillaryPacked
Active phase BPX-5SE-54SE-30
Column length (m) 50.30.3.05
Carrier gas HeHe
Substrate   Supelcoport; Chromosorb
Column diameter (mm) 0.320.32
Phase thickness (μm) 0.50.25
Program OC (5min) => 60C/min => 60C(5min) => 4C/min => 250C35C(2min) => 40C/min => 50C(2min) => 6C/min => 180C => 10C/min => 230C(10min)40C(5min) => 10C/min => 200C or 250C (60min)
I 773.739.726.
ReferenceBredie, Mottram, et al., 1998Hinterholzer and Schieberie, 1998Peng, Ding, et al., 1988
Comment MSDC-RI MSDC-RI MSDC-RI

Kovats' RI, polar column, custom temperature program

Data compiled by: NIST Mass Spectrometry Data Center, William E. Wallace, director

Column type CapillaryCapillaryCapillaryCapillary
Active phase DB-WaxCarbowax 20MCarbowax 20MCarbowax 20M
Column length (m) 30.30.
Carrier gas HeH2
Substrate
Column diameter (mm) 0.250.25
Phase thickness (μm) 0.25
Program 40C(5min) => 5C/min => 150C => 8C/min => 240C(25min)50 0C (8 min) 4 K/min -> 110 0C 16 K/min -> 200 0Cnot specifiednot specified
I 1185.1237.1212.1218.
ReferenceRezende and Fraga, 2003Garruti, Franco, et al., 2001Brander, Kepner, et al., 1980Brander, Kepner, et al., 1980
Comment MSDC-RI MSDC-RI MSDC-RI MSDC-RI

References

Markovnik, Shvarko, et al., 1987
Markovnik, V.S.; Shvarko, O.V.; Al'khimovich, V.M.; Sachek, A.I.,
Temperature dependence of vapor pressure, of heats of formation, combustion, and vaporization of 3-methyl-1-butanol,
Termodin. Org. Soedin., 1987, 68-70. [all data]
Chao and Rossini, 1965
Chao, J.; Rossini, F.D.,
Heats of combustion, formation, and isomerization of nineteen alkanols,
J. Chem. Eng. Data, 1965, 10, 374-379. [all data]
Cox and Pilcher, 1970
Cox, J.D.; Pilcher, G.,
Thermochemistry of Organic and Organometallic Compounds, Academic Press, New York, 1970, 1-636. [all data]
Stromsoe E., 1970
Stromsoe E.,
Heat capacity of alcohol vapors at atmospheric pressure,
J. Chem. Eng. Data, 1970, 15, 286-290. [all data]
Swietoslawski and Zielenkiewicz, 1958
Swietoslawski, W.; Zielenkiewicz, A.,
Mean specific heats of binary positive azeotropes,
Bull. Acad. Pol. Sci. Ser. Sci. Chim., 1958, 6, 367-369. [all data]
Zhdanov, 1945
Zhdanov, A.K.,
On the thermal capacity of some pure liquids and azeotropic mixtures,
Zhur. Obshch. Khim., 1945, 15, 895-902. [all data]
Willams and Daniels, 1924
Willams, J.W.; Daniels, F.,
The specific heats of certain organic liquids at elevated temperatures,
J. Am. Chem. Soc., 1924, 46, 903-917. [all data]
Gude and Teja, 1995
Gude, M.; Teja, A.S.,
Vapor-Liquid Critical Properties of Elements and Compounds. 4. Aliphatic Alkanols,
J. Chem. Eng. Data, 1995, 40, 1025-1036. [all data]
Quadri, Khilar, et al., 1991
Quadri, S.K.; Khilar, K.C.; Kudchadker, A.P.; Patni, M.J.,
Measurement of the critical temperatures and critical pressures of some thermally stable or mildly unstable alkanols,
J. Chem. Thermodyn., 1991, 23, 67-76. [all data]
Kreglewski, 1955
Kreglewski, A.,
The Critical Temperatures of Mixtures formed by Benzene and n-Octane with Iso-Alcohols,
Rocz. Chem., 1955, 29, 754. [all data]
Majer and Svoboda, 1985
Majer, V.; Svoboda, V.,
Enthalpies of Vaporization of Organic Compounds: A Critical Review and Data Compilation, Blackwell Scientific Publications, Oxford, 1985, 300. [all data]
Lladosa, Monton, et al., 2008
Lladosa, Estela; Monton, Juan B.; Burguet, MaCruz,
Isobaric Vapor-Liquid Equilibria for Binary and Ternary Mixtures of Diisopropyl Ether, 2-Propyl Alcohol, and 3-Methyl-1-Butanol,
J. Chem. Eng. Data, 2008, 53, 8, 1897-1902, https://doi.org/10.1021/je800298n
. [all data]
Aucejo, Burguet, et al., 1994
Aucejo, Antonio; Burguet, M.C.; Monton, Juan B.; Munoz, Rosa; Sanchotello, Margarita; Vazquez, M. Isabel,
Isothermal Vapor-Liquid Equilibria of 1-Pentanol with 2-Methyl-1-butanol, 2-Methyl-2-butanol, and 3-Methyl-2-butanol,
J. Chem. Eng. Data, 1994, 39, 3, 578-580, https://doi.org/10.1021/je00015a040
. [all data]
Stephenson and Malanowski, 1987
Stephenson, Richard M.; Malanowski, Stanislaw,
Handbook of the Thermodynamics of Organic Compounds, 1987, https://doi.org/10.1007/978-94-009-3173-2
. [all data]
Majer, Svoboda, et al., 1985
Majer, V.; Svoboda, V.; Lencka, M.,
Enthalpies of vaporization and cohesive energies of dimethylpyridines and trimethylpyridines,
The Journal of Chemical Thermodynamics, 1985, 17, 4, 365-370, https://doi.org/10.1016/0021-9614(85)90133-8
. [all data]
Wilhoit and Zwolinski, 1973
Wilhoit, R.C.; Zwolinski, B.J.,
Physical and thermodynamic properties of aliphatic alcohols,
J. Phys. Chem. Ref. Data Suppl., 1973, 1, 2, 1. [all data]
Haas and Harrison, 1993
Haas, M.J.; Harrison, A.G.,
The Fragmentation of Proton-Bound Cluster Ions and the Gas-Phase Acidities of Alcohols,
Int. J. Mass Spectrom. Ion Proc., 1993, 124, 2, 115, https://doi.org/10.1016/0168-1176(93)80003-W
. [all data]
Boand, Houriet, et al., 1983
Boand, G.; Houriet, R.; Baumann, T.,
The gas phase acidity of aliphatic alcohols,
J. Am. Chem. Soc., 1983, 105, 2203. [all data]