3-Heptene, 2,2,4,6,6-pentamethyl-
- Formula: C12H24
- Molecular weight: 168.3190
- IUPAC Standard InChIKey: NBUMCEJRJRRLCA-CSKARUKUSA-N
- CAS Registry Number: 123-48-8
- Chemical structure:
View 3d structure (requires JavaScript / HTML 5) - Species with the same structure:
- Stereoisomers:
- Other names: 2,2,4,6,6-Pentamethylheptene-3; 2,2,4,6,6-Pentamethyl-3-heptene; 2,2,4,6,6-Pentamethyl-3-heptene,c&t; 2,2,4,6,6-pentamethylhept-3-ene

Phase change data

Data compiled by: Thermodynamics Research Center, NIST Boulder Laboratories, Chris Muzny director
Quantity | Value | Units | Method | Reference | Comment |
---|---|---|---|---|---|
Tboil | 453.7 | K | N/A | Davis and Hickinbottom, 1957 | Uncertainty assigned by TRC = 2. K |

References

Davis and Hickinbottom, 1957
Davis, M.A.; Hickinbottom, W.J.,
Synthesis and Reactions of Branched-chain Hydrocarbons XI. 2,2,4,6,6-Penta- methylhept-3-ene, one and the Constibution of Triisobutylene,
J. Chem. Soc., 1957, 1957, 1998. [all data]