β-Myrcene
- Formula: C10H16
- Molecular weight: 136.2340
- IUPAC Standard InChIKey: UAHWPYUMFXYFJY-UHFFFAOYSA-N
- CAS Registry Number: 123-35-3
- Chemical structure:
View 3d structure (requires JavaScript / HTML 5) - Other names: 1,6-Octadiene, 7-methyl-3-methylene-; Myrcene; 7-Methyl-3-methylene-1,6-octadiene; 7-Methyl-3-methyleneoctadiene-(1,6); 2-Methyl-6-methylene-2,7-octadiene; 3-Methylene-7-methyl-1,6-octadiene; β-Geraniolene; 7-Methyl-3-methyleneocta-1,6-diene; beta-Myrcene; Myrcene, β-; NSC 406264; b-myrcene; β-mircene; 7-methyl-3-methylene-1,6-octadiene (myrcene); 7-methyl-3-methylene-1,6-octadiene (β-myrcene)

Phase change data

Data compiled as indicated in comments:
BS - Robert L. Brown and Stephen E. Stein
TRC - Thermodynamics Research Center, NIST Boulder Laboratories, Chris Muzny director
AC - William E. Acree, Jr., James S. Chickos
Quantity | Value | Units | Method | Reference | Comment |
---|---|---|---|---|---|
Tboil | 440.2 | K | N/A | Weast and Grasselli, 1989 | BS |
Tboil | 445. | K | N/A | Semmler, 1901 | Uncertainty assigned by TRC = 5. K; TRC |
Quantity | Value | Units | Method | Reference | Comment |
ΔvapH° | 50.6 | kJ/mol | GC | van Roon, Parsons, et al., 2002 | AC |
Enthalpy of vaporization
ΔvapH (kJ/mol) | Temperature (K) | Method | Reference | Comment |
---|---|---|---|---|
45.7 | 302. | A | Stephenson and Malanowski, 1987 | Based on data from 287. to 445. K. See also Stull, 1947.; AC |
47.0 | 318. | N/A | Bukala, Majewski, et al., 1954 | Based on data from 303. to 363. K.; AC |
Antoine Equation Parameters
log10(P) = A − (B / (T + C))
P = vapor pressure (bar)
T = temperature (K)
View plot Requires a JavaScript / HTML 5 canvas capable browser.
Temperature (K) | A | B | C | Reference | Comment |
---|---|---|---|---|---|
287.7 to 444.7 | 4.56112 | 1849.102 | -38.899 | Stull, 1947 | Coefficents calculated by NIST from author's data. |

Condensed phase thermochemistry data

Data compiled by: Hussein Y. Afeefy, Joel F. Liebman, and Stephen E. Stein
Quantity | Value | Units | Method | Reference | Comment |
---|---|---|---|---|---|
ΔcH°liquid | -1490.50 ± 0.50 | kcal/mol | Ccb | Hawkins and Eriksen, 1954 | Reanalyzed by Cox and Pilcher, 1970, Original value = -1490.4 ± 0.24 kcal/mol; Corresponding ΔfHºliquid = 3.47 kcal/mol (simple calculation by NIST; no Washburn corrections) |

Van Den Dool and Kratz RI, non-polar column, temperature ramp

Data compiled by: NIST Mass Spectrometry Data Center, William E. Wallace, director

Column type CapillaryCapillaryCapillaryCapillaryCapillary
Active phase RTX-1DB-5Equity-5MSHP-5MSHP-5
Column length (m) 60.30.30.30.30.
Carrier gas HeHeHeHeHe
Substrate
Column diameter (mm) 0.220.250.250.250.25
Phase thickness (μm) 0.250.250.250.250.25
Tstart (C) 60.60.50.60.40.
Tend (C) 230.240.250.250.250.
Heat rate (K/min) 2.3.3.2.5.
Initial hold (min)    8.1.
Final hold (min) 30. 10.30.10.
I 979.992.989.990.990.
ReferenceBendahou, Muselli, et al., 2008Baccouri, Ben Temime, et al., 2007Belsito E.L., Carbone C., et al., 2007Benkaci-Ali, Baaliouamer, et al., 2007Benzo, Gilardoni, et al., 2007
Comment MSDC-RI MSDC-RI MSDC-RI MSDC-RI MSDC-RI
Column type CapillaryCapillaryCapillaryCapillaryCapillary
Active phase BP-1BP-1CP-Sil PONA GBHP-5BP-1
Column length (m) 50.50.100.25.50.
Carrier gas HeHeHeHeHe
Substrate
Column diameter (mm) 0.220.220.250.250.22
Phase thickness (μm) 0.250.250.250.250.25
Tstart (C) 60.60.140.60.60.
Tend (C) 220.220.230.240.220.
Heat rate (K/min) 2.2.5.4.2.
Initial hold (min)   10.2.
Final hold (min) 20.20.25. 20.
I 981.980.981.995.981.
ReferenceBoti, Koukoua, et al., 2007Castilho, Liu, et al., 2007Cunicao, Lopes, et al., 2007Dehghan, Solaimanian, et al., 2007Duquesnoy, Castola, et al., 2007
Comment MSDC-RI MSDC-RI MSDC-RI MSDC-RI MSDC-RI
Column type CapillaryCapillaryCapillaryCapillaryCapillary
Active phase DB-5HP-5HP-5DB-5BP-1
Column length (m) 30.30.30.30.50.
Carrier gas HeN2N2HeHe
Substrate
Column diameter (mm) 0.250.250.250.250.22
Phase thickness (μm) 0.250.250.250.250.25
Tstart (C) 60.50.60.60.60.
Tend (C) 240.220.220.246.220.
Heat rate (K/min) 3.5.5.3.2.
Initial hold (min)  10.10.
Final hold (min)     20.
I 992.992.992.990.980.
ReferenceFlamini, Cioni, et al., 2007Flamini, Tebano, et al., 2007Flamini, Tebano, et al., 2007, 2Hongratanaworakit and Buchbauer, 2007Lesueur, de Rocca Serra, et al., 2007
Comment MSDC-RI MSDC-RI MSDC-RI MSDC-RI MSDC-RI
Column type CapillaryCapillaryCapillaryCapillaryCapillary
Active phase DB-5DB-5DB-5RTX-1RTX-1
Column length (m) 30.30.30.60.60.
Carrier gas HeHe HeHe
Substrate
Column diameter (mm) 0.250.320.220.220.22
Phase thickness (μm) 0.250.50.250.250.25
Tstart (C) 60.40.60.60.60.
Tend (C) 240.265.240.230.230.
Heat rate (K/min) 3.7.3.2.2.
Initial hold (min)   2.
Final hold (min)  5. 35.35.
I 991.986.991.981.981.
ReferenceMaccioni, Baldini, et al., 2007Mahattanatawee K., Perez-Cacho P.R., et al., 2007Martins, Santos, et al., 2007Paolini J., Costa J., et al., 2007Paolini, Muselli, et al., 2007
Comment MSDC-RI MSDC-RI MSDC-RI MSDC-RI MSDC-RI
Column type CapillaryCapillaryCapillaryCapillaryCapillary
Active phase HP-5Equity-5DB-5ZB-5DB-5
Column length (m) 30.60.25.30.30.
Carrier gas HeHeHeHeHe
Substrate
Column diameter (mm) 0.250.250.250.320.25
Phase thickness (μm) 0.251.0.250.50.25
Tstart (C) 50.40.60.40.60.
Tend (C) 250.260.200.265.260.
Heat rate (K/min) 4.5.2.7.5.
Initial hold (min) 4.1.
Final hold (min) 10.15.60.5.
I 991.995.992.992.990.
ReferenceQuijano, Salamanca, et al., 2007Rocha, Coelho, et al., 2007Rout, Rao, et al., 2007Ruiz Perez-Cacho, Mahattanatawee, et al., 2007Sabulal, Dan, et al., 2007
Comment MSDC-RI MSDC-RI MSDC-RI MSDC-RI MSDC-RI
Column type CapillaryCapillaryCapillaryCapillaryCapillary
Active phase HP-5MSHP-5MSDB-5ZB-5DB-5
Column length (m) 30.30.30.30.30.
Carrier gas HeHeHeHeHe
Substrate
Column diameter (mm) 0.250.250.220.250.25
Phase thickness (μm) 0.250.250.250.250.25
Tstart (C) 60.60.55.50.60.
Tend (C) 280.280.240.250.240.
Heat rate (K/min) 4.4.3.3.3.
Initial hold (min) 5.5.2.
Final hold (min)   15.
I 991.988.990.991.991.
ReferenceSaroglou, Arfan, et al., 2007Saroglou, Marin, et al., 2007Silva, Barbosa, et al., 2007Simoniatto, Bonani, et al., 2007Telascrea, de Araujo, et al., 2007
Comment MSDC-RI MSDC-RI MSDC-RI MSDC-RI MSDC-RI
Column type CapillaryCapillaryCapillaryCapillaryCapillary
Active phase HP-5MSCP Sil 5 CBDB-5DB-5BP-1
Column length (m) 30.30.30.30.50.
Carrier gas HeN2 HeHe
Substrate
Column diameter (mm) 0.250.250.250.20.22
Phase thickness (μm) 0.250.250.250.250.25
Tstart (C) 60.50.60.50.60.
Tend (C) 280.200.220.250.220.
Heat rate (K/min) 3.5.3.5.2.
Initial hold (min)    3.
Final hold (min)    15.20.
I 992.984.990.994.977.
ReferenceVagionas, Ngassapa, et al., 2007Andrianoelisoa H.S., Menut C., et al., 2006Bastos, Ishimoto, et al., 2006Blagojevic, Radulovic, et al., 2006Boti, Bighelli, et al., 2006
Comment MSDC-RI MSDC-RI MSDC-RI MSDC-RI MSDC-RI
Column type CapillaryCapillaryCapillaryCapillaryCapillary
Active phase DB-5RTX-1HP-5MS5 % Phenyl methyl siloxaneDB-5
Column length (m) 30.60.30.25.30.
Carrier gas  HeHeHeN2
Substrate
Column diameter (mm) 0.250.220.250.250.32
Phase thickness (μm) 1.0.250.250.250.25
Tstart (C) 50.60.60.60.60.
Tend (C) 290.230.280.280.240.
Heat rate (K/min) 10.2.3.3.3.
Initial hold (min) 1.   3.
Final hold (min) 10.45. 20.5.
I 990.982.990.997.990.
ReferenceBylaite and Meyer, 2006Cavalli, Tomi, et al., 2006Chorianopoulos N., Evergets E., et al., 2006Djarri, Medjroubi, et al., 2006Dob, Dahmane, et al., 2006
Comment MSDC-RI MSDC-RI MSDC-RI MSDC-RI MSDC-RI
Column type CapillaryCapillaryCapillaryCapillaryCapillary
Active phase DB-5DB-5HP-5BP-1HP-5
Column length (m) 30.50.30.50.30.
Carrier gas N2N2N2HeHe
Substrate
Column diameter (mm) 0.250.20.250.220.25
Phase thickness (μm) 0.250.320.250.250.25
Tstart (C) 60.60.60.60.60.
Tend (C) 240.220.220.220.260.
Heat rate (K/min) 3.5.5.2.3.
Initial hold (min) 3.3.10.
Final hold (min) 3.5. 20.
I 986.992.992.982.990.
ReferenceDob, Dahmane, et al., 2006, 2Esmaeili, Nematollahi, et al., 2006Flamini, Tebano, et al., 2006Gonny, Cavaleiro, et al., 2006Javidnia, Miri, et al., 2006
Comment MSDC-RI MSDC-RI MSDC-RI MSDC-RI MSDC-RI
Column type CapillaryCapillaryCapillaryCapillaryCapillary
Active phase DB-1HP-5DB-5DB-1DB-5
Column length (m) 30.30.50.25.30.
Carrier gas N2HeN2 He
Substrate
Column diameter (mm) 0.250.250.20.20.32
Phase thickness (μm) 0.250.250.320.330.25
Tstart (C) 50.60.60.50.60.
Tend (C) 220.250.220.300.280.
Heat rate (K/min) 4.10.5.4.3.
Initial hold (min)  2.3.
Final hold (min)  10.5.
I 988.983.991.985.985.
ReferenceKuiate, Bessière, et al., 2006Liu J.M., Nan P., et al., 2006Masoudi, Esmaeili, et al., 2006Osorio, Alarcon, et al., 2006Pavlovic, Tzakou, et al., 2006
Comment MSDC-RI MSDC-RI MSDC-RI MSDC-RI MSDC-RI
Column type CapillaryCapillaryCapillaryCapillaryCapillary
Active phase HP-5SPB-1SPB-1DB-1DB-1
Column length (m) 60.30.30.30.30.
Carrier gas HeHeHeHeHe
Substrate
Column diameter (mm) 0.250.20.250.250.25
Phase thickness (μm) 0.250.20.250.250.25
Tstart (C) 60.70.50.50.60.
Tend (C) 250.220.250.265.240.
Heat rate (K/min) 3.3.5.2.54.
Initial hold (min)   3.
Final hold (min)  15.15.
I 992.980.1013.971.987.
ReferencePerraudin, Popovici, et al., 2006Pinto, Pina-Vaz, et al., 2006Radulovic, Mananjarasoa, et al., 2006Ramezani, Behravan, et al., 2006Rezazadeh, Hamedani, et al., 2006
Comment MSDC-RI MSDC-RI MSDC-RI MSDC-RI MSDC-RI
Column type CapillaryCapillaryCapillaryCapillaryCapillary
Active phase HP-5OV-1SPB-1HP-5MSDB-5
Column length (m) 25.25.30.30.30.
Carrier gas HeHeHeHeHe
Substrate
Column diameter (mm) 0.250.250.20.250.25
Phase thickness (μm) 0.250.250.20.250.25
Tstart (C) 60.50.70.60.50.
Tend (C) 240.220.220.280.250.
Heat rate (K/min) 4.3.3.4.5.
Initial hold (min)  1. 5.2.
Final hold (min)  5.15.
I 991.995.981.991.991.
ReferenceRezazadeh, Hamedani, et al., 2006Rubiolo P., Matteodo M., et al., 2006Salgueiro L.R., Pinto E., et al., 2006Saroglou, Dorizas, et al., 2006Su, Ho, et al., 2006
Comment MSDC-RI MSDC-RI MSDC-RI MSDC-RI MSDC-RI
Column type CapillaryCapillaryCapillaryCapillaryCapillary
Active phase DB-5HP-5DB-5HP-5DB-5
Column length (m) 30.30.30.30.30.
Carrier gas HeHeHeHeHe
Substrate
Column diameter (mm) 0.250.250.320.250.25
Phase thickness (μm) 0.250.250.250.250.25
Tstart (C) 50.40.40.60.90.
Tend (C) 250.300.230.250.220.
Heat rate (K/min) 5.4.6.10.4.
Initial hold (min) 2.5.1.2.2.
Final hold (min)    10.
I 991.990.990.995.990.
ReferenceSu, Ho, et al., 2006, 2Vundac, Pfeifhofer, et al., 2006Zeller and Rychlik, 2006Zhao J.Y., Liu J.M., et al., 2006Agnihotri, Agarwal, et al., 2005
Comment MSDC-RI MSDC-RI MSDC-RI MSDC-RI MSDC-RI
Column type CapillaryCapillaryCapillaryCapillaryCapillary
Active phase DB-1SPB-1DB-5BP-1SE-54
Column length (m) 30.30.30.50.50.
Carrier gas N2HeHeHeH2
Substrate
Column diameter (mm) 0.250.250.20.220.25
Phase thickness (μm) 0.250.250.250.250.27
Tstart (C) 50.50.50.60.50.
Tend (C) 200.250.250.220.300.
Heat rate (K/min) 5.5.5.2.5.
Initial hold (min)  3.3.
Final hold (min)  15.15.20.
I 984.1013.990.981.986.
ReferenceAgnaniet, Makani, et al., 2005Boskovic, Radulovic, et al., 2005Boskovic, Radulovic, et al., 2005Boti J.B., Koukoua G., et al., 2005Brantner, Pfeifhofer, et al., 2005
Comment MSDC-RI MSDC-RI MSDC-RI MSDC-RI MSDC-RI
Column type CapillaryCapillaryCapillaryCapillaryCapillary
Active phase HP-5DB-5RTX-1DB-1DB-1
Column length (m) 30.60.60.30.30.
Carrier gas N2N2 N2N2
Substrate
Column diameter (mm) 0.250.250.220.320.32
Phase thickness (μm) 0.250.250.250.250.25
Tstart (C) 60.70.60.50.50.
Tend (C) 220.230.220.260.260.
Heat rate (K/min) 5.2.2.2.2.
Initial hold (min) 10.2. 3.3.
Final hold (min)  20.20.5.5.
I 992.991.981.979.997.
ReferenceCelik, Gokturk, et al., 2005Choi, 2005Cozzani, Muselli, et al., 2005Dob, Berramdane, et al., 2005Dob, Berramdane, et al., 2005, 2
Comment MSDC-RI MSDC-RI MSDC-RI MSDC-RI MSDC-RI
Column type CapillaryCapillaryCapillaryCapillaryCapillary
Active phase DB-1DB-1MDN-55 % Phenyl methyl siloxaneDB-1
Column length (m) 30.30.30.30.30.
Carrier gas N2 HeHeHe
Substrate
Column diameter (mm) 0.320.320.250.250.25
Phase thickness (μm) 0.250.250.251.0.25
Tstart (C) 50.50.50.40.40.
Tend (C) 260.250.250.250.250.
Heat rate (K/min) 2.2.3.7.3.
Initial hold (min) 3.8. 10.
Final hold (min) 5.  5.20.
I 976.979.987.1006.983.
ReferenceDob T., Berramdane T., et al., 2005Dob, Dahmane, et al., 2005Dugo, Mondello, et al., 2005Estevez, Ventanas, et al., 2005Fanciullino, Gancel, et al., 2005
Comment MSDC-RI MSDC-RI MSDC-RI MSDC-RI MSDC-RI
Column type CapillaryCapillaryCapillaryCapillaryCapillary
Active phase DB-1BP-1HP-5HP-5DB-1
Column length (m) 30.50.30.30.30.
Carrier gas HeHeN2N2He
Substrate
Column diameter (mm) 0.250.220.250.250.25
Phase thickness (μm) 0.250.250.250.250.25
Tstart (C) 40.60.60.60.40.
Tend (C) 260.220.220.220.250.
Heat rate (K/min) 2.2.5.5.3.
Initial hold (min) 5. 10.10.
Final hold (min) 20.20.  20.
I 986.983.992.992.984.
Referencede Feo, Urrunaga Soria, et al., 2005Ferrari, Tomi, et al., 2005Flamini, Luigi Cioni, et al., 2005Flamini, Luigi Cioni, et al., 2005, 2Gancel, Ollitrault, et al., 2005
Comment MSDC-RI MSDC-RI MSDC-RI MSDC-RI MSDC-RI
Column type CapillaryCapillaryCapillaryCapillaryCapillary
Active phase CP Sil 5 CBDB-1DB-5HP-5HP-5
Column length (m) 50.25.25.30.30.
Carrier gas H2 N2HeHe
Substrate
Column diameter (mm) 0.220.250.250.250.25
Phase thickness (μm) 0.130.250.250.250.25
Tstart (C) 40.60.75.60.50.
Tend (C) 300.180.210.260.250.
Heat rate (K/min) 4.3.3.3.4.
Initial hold (min)  10.10. 5.
Final hold (min) 10.10.1. 15.
I 982.990.990.989.984.
ReferenceIdzojtic, Kajba, et al., 2005bin Jantan, Yalvema, et al., 2005bin Jantan, Yalvema, et al., 2005, 2Javidnia, Miri, et al., 2005Mahattanatawee, Goodner, et al., 2005
Comment MSDC-RI MSDC-RI MSDC-RI MSDC-RI MSDC-RI
Column type CapillaryCapillaryCapillaryCapillaryCapillary
Active phase HP-5HP-5RTX-1HP-5MSDB-5MS
Column length (m) 30.30.60.30.60.
Carrier gas HeHeHeHeHe
Substrate
Column diameter (mm) 0.250.250.220.250.25
Phase thickness (μm) 0.250.250.250.250.25
Tstart (C) 50.50.60.60.40.
Tend (C) 250.250.230.250.200.
Heat rate (K/min) 4.4.2.4.2.
Initial hold (min) 5.5. 2.
Final hold (min) 15.15.35.20.20.
I 985.988.981.991.995.
ReferenceMahattanatawee, Goodner, et al., 2005Mahattanatawee, Goodner, et al., 2005Paolini, Costa, et al., 2005Pino, Mesa, et al., 2005Seo and Baek, 2005
Comment MSDC-RI MSDC-RI MSDC-RI MSDC-RI MSDC-RI
Column type CapillaryCapillaryCapillaryCapillaryCapillary
Active phase SE-54HP-5MSDB-1BP-1Mega 5MS
Column length (m) 25.60.30.50.30.
Carrier gas H2HeN2HeHe
Substrate
Column diameter (mm) 0.250.20.250.220.25
Phase thickness (μm) 0.20.250.250.250.25
Tstart (C) 50.60.50.60.40.
Tend (C) 250.200.200.230.240.
Heat rate (K/min) 4.2.5.2.3.
Initial hold (min)     2.
Final hold (min)  10. 35.
I 991.988.983.981.987.
ReferenceSimionatto, Porto, et al., 2005Smadja, Rondeau, et al., 2005Tchoumbougnang, Zollo, et al., 2005Vellutini, Baldovini, et al., 2005Verzera, Trozzi, et al., 2005
Comment MSDC-RI MSDC-RI MSDC-RI MSDC-RI MSDC-RI
Column type CapillaryCapillaryCapillaryCapillaryCapillary
Active phase DB-5HP-5MSSE-54SPB-1ZB-5
Column length (m) 30.30.30.30.30.
Carrier gas N2HeHeHeHelium
Substrate
Column diameter (mm) 0.250.250.250.250.32
Phase thickness (μm) 0.250.250.250.250.50
Tstart (C) 45.60.60.70.40.
Tend (C) 180.280.260.220.265.
Heat rate (K/min) 2.53.2.3.7.
Initial hold (min) 10. 5.
Final hold (min) 20.  15.5.
I 993.991.994.981.989.
ReferenceZhang, Xu, et al., 2005Aligiannis, Kalpoutzakis, et al., 2004Alma, Nitz, et al., 2004Antunes, Sevinate-Pinto, et al., 2004Bell, 2004
Comment MSDC-RI MSDC-RI MSDC-RI MSDC-RI MSDC-RI
Column type CapillaryCapillaryCapillaryCapillaryCapillary
Active phase DB-5HP-5HP-5SPB-1HP-5
Column length (m) 60.30.30.30.30.
Carrier gas HeliumN2N2He
Substrate
Column diameter (mm) 0.250.250.250.20.25
Phase thickness (μm) 0.250.250.250.20.25
Tstart (C) 40.60.60.70.60.
Tend (C) 250.220.220.220.220.
Heat rate (K/min) 7.5.5.3.5.
Initial hold (min)  10.10. 10.
Final hold (min)    15.
I 987.986.986.980.992.
ReferenceBell, 2004Bertoli, Menichini, et al., 2004Bertoli, Pistelli, et al., 2004Cavaleiro, Salgueiro, et al., 2004Ceccarini, Macchia, et al., 2004
Comment MSDC-RI MSDC-RI MSDC-RI MSDC-RI MSDC-RI
Column type CapillaryCapillaryCapillaryCapillaryCapillary
Active phase HP-5MSRTX-5HP-1HP-5DB-5
Column length (m) 30.30.25.30.30.
Carrier gas HeHeHeHeN2
Substrate
Column diameter (mm) 0.250.250.320.250.25
Phase thickness (μm) 0.250.250.170.250.25
Tstart (C) 60.45.50.60.60.
Tend (C) 280.300.200.240.240.
Heat rate (K/min) 3.3.3.3.3.
Initial hold (min)  6.
Final hold (min)  10.
I 990.990.968.992.992.
ReferenceChorianopoulos, Kalpoutzakis, et al., 2004Dugo, Mondello, et al., 2004Fernández-Ocaña, Gómez-Rodríguez, et al., 2004Flamini, Bader, et al., 2004Flamini, Cioni, et al., 2004
Comment MSDC-RI MSDC-RI MSDC-RI MSDC-RI MSDC-RI
Column type CapillaryCapillaryCapillaryCapillaryCapillary
Active phase DB-5BP-1HP-5MSDB-5MSSPB-1
Column length (m) 30.50.30.30.30.
Carrier gas N2 HeHeHe
Substrate
Column diameter (mm) 0.250.220.250.250.2
Phase thickness (μm) 0.250.250.250.250.2
Tstart (C) 60.60.60.40.70.
Tend (C) 240.220.280.280.220.
Heat rate (K/min) 3.2.4.4.3.
Initial hold (min)   5.2.
Final hold (min)  20.  15.
I 992.981.988.989.980.
ReferenceFlamini, Cioni, et al., 2004Gonny, Bradesi, et al., 2004Grujic-Jovanovic, Skaltsa, et al., 2004Mardarowicz, Wianowska, et al., 2004Moldão-Martins, Beirão-da-Costa, et al., 2004
Comment MSDC-RI MSDC-RI MSDC-RI MSDC-RI MSDC-RI
Column type CapillaryCapillaryCapillaryCapillaryCapillary
Active phase SPB-1HP-5MSRSL-200Methyl SiliconeBP-1
Column length (m) 30.30.30.50.30.
Carrier gas HeHeH2HeN2
Substrate
Column diameter (mm) 0.20.250.320.250.32
Phase thickness (μm) 0.20.250.25 0.25
Tstart (C) 70.50.40.50.60.
Tend (C) 220.300.280.240.220.
Heat rate (K/min) 3.5.6.3.5.
Initial hold (min)  5.5.
Final hold (min) 15. 5. 13.
I 980.991.983.991.981.
ReferenceMoldão-Martins, Beirão-da-Costa, et al., 2004Mumm, Tiemann, et al., 2004Ngassoum, Ousmaila, et al., 2004Özcan and Chalchat, 2004Raina, Kumar, et al., 2004
Comment MSDC-RI MSDC-RI MSDC-RI MSDC-RI MSDC-RI
Column type CapillaryCapillaryCapillaryCapillaryCapillary
Active phase DB-5DB-5HP-5MSHP-5HP-5
Column length (m) 30.30.30.30.50.
Carrier gas HeHeHe He
Substrate
Column diameter (mm) 0.250.250.250.250.2
Phase thickness (μm) 0.250.250.251.0.2
Tstart (C) 60.50.50.-30.40.
Tend (C) 275.290.250.250.250.
Heat rate (K/min) 4.4.3.10.3.
Initial hold (min)    1.15.
Final hold (min)     40.
I 993.988.990.991.991.
ReferenceRamezani, Khaje-Karamoddin, et al., 2004Reis, Pansarim, et al., 2004Salido, Valenzuela, et al., 2004Siegmund, Derler, et al., 2004Stashenko, Jaramillo, et al., 2004
Comment MSDC-RI MSDC-RI MSDC-RI MSDC-RI MSDC-RI
Column type CapillaryCapillaryCapillaryCapillaryCapillary
Active phase HP-5BP-1HP-5MSOptima 5DB-5MS
Column length (m) 50.50.30.25.30.
Carrier gas HeHeHeHeHe
Substrate
Column diameter (mm) 0.20.220.250.250.25
Phase thickness (μm) 0.20.250.250.250.25
Tstart (C) 35.60.60.60.40.
Tend (C) 250.220.280.280.200.
Heat rate (K/min) 3.2.3.3.4.
Initial hold (min) 15.   5.
Final hold (min) 40.20. 20.20.
I 993.980.970.986.997.
ReferenceStashenko, Jaramillo, et al., 2004, 2Tam, Thuam, et al., 2004Tzakou, Vagias, et al., 2004Vérité, Nacer, et al., 2004Yu, Kim, et al., 2004
Comment MSDC-RI MSDC-RI MSDC-RI MSDC-RI MSDC-RI
Column type CapillaryCapillaryCapillaryCapillaryCapillary
Active phase DB-5MSDB-5MSDB-5MSDB-5MSDB-5MS
Column length (m) 30.30.30.30.30.
Carrier gas HeHeHeHeHe
Substrate
Column diameter (mm) 0.250.250.250.250.25
Phase thickness (μm) 0.250.250.250.250.25
Tstart (C) 40.40.40.40.40.
Tend (C) 200.200.200.200.200.
Heat rate (K/min) 4.4.4.4.4.
Initial hold (min) 5.5.5.5.5.
Final hold (min) 20.20.20.20.20.
I 999.992.992.995.991.
ReferenceYu, Kim, et al., 2004Yu, Kim, et al., 2004, 2Yu, Kim, et al., 2004, 2Zheng, Kim, et al., 2004Zheng, Kim, et al., 2004
Comment MSDC-RI MSDC-RI MSDC-RI MSDC-RI MSDC-RI
Column type CapillaryCapillaryCapillaryCapillaryCapillary
Active phase HP-5HP-5DB-5DB-5OV-1
Column length (m) 30.30.30.30.25.
Carrier gas N2N2HeN2H2
Substrate
Column diameter (mm) 0.250.250.250.250.25
Phase thickness (μm) 0.250.250.250.250.3
Tstart (C) 60.60.60.60.50.
Tend (C) 220.220.240.220.200.
Heat rate (K/min) 5.5.3.5.3.
Initial hold (min) 10.10. 10.1.
Final hold (min)   30. 20.
I 992.992.992.992.984.
ReferenceAngelini, Carpanese, et al., 2003Angelini, Carpanese, et al., 2003Bader, Caponi, et al., 2003Bader, Caponi, et al., 2003, 2Bicchi, Rubiolo, et al., 2003
Comment MSDC-RI MSDC-RI MSDC-RI MSDC-RI MSDC-RI
Column type CapillaryCapillaryCapillaryCapillaryCapillary
Active phase DB-1SPB-1RTX-1Ultra-2SPB-1
Column length (m) 30.30.60.25.30.
Carrier gas HeHeHeH2He
Substrate
Column diameter (mm) 0.250.20.220.250.25
Phase thickness (μm) 0.250.20.250.330.25
Tstart (C) 40.70.60.40.35.
Tend (C) 250.220.230.280.225.
Heat rate (K/min) 3.3.2.3.4.
Initial hold (min)    2.5.
Final hold (min) 20.15.45.10.20.
I 976.980.981.991.982.
ReferenceBrat, Rega, et al., 2003Cavaleiro, Salgueiro, et al., 2003Cavalli, Tomi, et al., 2003Ceva-Antunes, Bizzo, et al., 2003Chisholm, Jell, et al., 2003
Comment MSDC-RI MSDC-RI MSDC-RI MSDC-RI MSDC-RI
Column type CapillaryCapillaryCapillaryCapillaryCapillary
Active phase SPB-1DB-5HP-5HP-5DB-1
Column length (m) 25.30.30.30.30.
Carrier gas  N2N2N2He
Substrate
Column diameter (mm) 0.250.250.250.250.25
Phase thickness (μm) 0.250.250.250.250.25
Tstart (C) 35.70.60.60.40.
Tend (C) 225.230.220.220.250.
Heat rate (K/min) 4.2.5.5.2.
Initial hold (min) 10.2.10.10.5.
Final hold (min)  20.  20.
I 986.991.992.992.981.
ReferenceChisholm, Wilson, et al., 2003Choi, 2003Emilio Tomei, Manganelli, et al., 2003Ertugrul, Dural, et al., 2003de Feo, Bruno, et al., 2003
Comment MSDC-RI MSDC-RI MSDC-RI MSDC-RI MSDC-RI
Column type CapillaryCapillaryCapillaryCapillaryCapillary
Active phase DB-1DB-5HP-5HP-5HP-5
Column length (m) 30.30.30.30.30.
Carrier gas HeHeN2N2N2
Substrate
Column diameter (mm) 0.250.250.250.250.25
Phase thickness (μm) 0.250.250.250.250.25
Tstart (C) 40.60.60.60.60.
Tend (C) 250.240.220.220.220.
Heat rate (K/min) 2.3.5.5.5.
Initial hold (min) 5. 10.10.10.
Final hold (min)
I 982.992.992.992.991.
Referencede Feo, Urrunaga Soria, et al., 2003Flamini, Luigi Cioni, et al., 2003Flamini, Luigi Cioni, et al., 2003, 2Flamini, Luigi Cioni, et al., 2003, 3Flamini, Luigi Cioni, et al., 2003, 4
Comment MSDC-RI MSDC-RI MSDC-RI MSDC-RI MSDC-RI
Column type CapillaryCapillaryCapillaryCapillaryCapillary
Active phase DB-1DB-5DB-5HP-5DB-5
Column length (m) 30.30.30.30.30.
Carrier gas He   He
Substrate
Column diameter (mm) 0.250.320.320.250.25
Phase thickness (μm) 0.250.50.5 0.25
Tstart (C) 40.40.40.25.75.
Tend (C) 250.265.265.150.230.
Heat rate (K/min) 3.7.7.3.3.
Initial hold (min)    5.10.
Final hold (min) 20.5.5. 20.
I 984.994.992.990.990.
ReferenceGancel, Ollitrault, et al., 2003Högnadóttir and Rouseff, 2003Högnadóttir and Rouseff, 2003Isidorov, Vinogorova, et al., 2003Jantan, Ling, et al., 2003
Comment MSDC-RI MSDC-RI MSDC-RI MSDC-RI MSDC-RI
Column type CapillaryCapillaryCapillaryCapillaryCapillary
Active phase DB-5DB-5HP-5HP-5HP-5MS
Column length (m) 30.25.30.30.30.
Carrier gas N2HeHeHeHe
Substrate
Column diameter (mm) 0.250.250.250.250.25
Phase thickness (μm) 0.25 0.250.250.25
Tstart (C) 75.60.60.60.60.
Tend (C) 230.260.280.240.280.
Heat rate (K/min) 3.4.4.3.3.
Initial hold (min) 10. 5.
Final hold (min)
I 990.992.990.993.989.
Referencebin Jantan, Yassin, et al., 2003Javidnia, Miri, et al., 2003Karioti, Skaltsa, et al., 2003Macchioni, Cioni, et al., 2003Mimica-Dukic, Kujundzic, et al., 2003
Comment MSDC-RI MSDC-RI MSDC-RI MSDC-RI MSDC-RI
Column type CapillaryCapillaryCapillaryCapillaryCapillary
Active phase HP-5CP Sil 5 CBSPB-5HP-5MSMS5
Column length (m) 30.60.30.30.25.
Carrier gas HeHeHeHe
Substrate
Column diameter (mm) 0.250.320.250.250.25
Phase thickness (μm) 0.250.250.250.250.25
Tstart (C) 60.60.60.50.40.
Tend (C) 280.280.250.250.180.
Heat rate (K/min) 3.3.4.3.3.
Initial hold (min)  10.2.
Final hold (min)  60.20.
I 991.981.991.990.991.
ReferenceNgassapa, Runyoro, et al., 2003Pino, Almora, et al., 2003Pino, Marbot, et al., 2003Salido, Altarejos, et al., 2003Shao, Marriott, et al., 2003
Comment MSDC-RI MSDC-RI MSDC-RI MSDC-RI MSDC-RI
Column type CapillaryCapillaryCapillaryCapillaryCapillary
Active phase RTX-5HP-5HP-5DB-5HP-5
Column length (m) 30.30.30.30.30.
Carrier gas HeHeHeHeHe
Substrate
Column diameter (mm) 0.250.250.250.250.25
Phase thickness (μm) 0.250.250.250.250.25
Tstart (C) 45.40.60.60.60.
Tend (C) 250.240.280.240.280.
Heat rate (K/min) 3.3.4.3.3.
Initial hold (min) 6. 5.
Final hold (min)
I 993.992.988.993.991.
ReferenceShellie, Marriott, et al., 2003Shellie and Marriott, 2003Skaltsa, Demetzos, et al., 2003Tampieri, Galuppi, et al., 2003Tsiri, Kretsi, et al., 2003
Comment MSDC-RI MSDC-RI MSDC-RI MSDC-RI MSDC-RI
Column type CapillaryCapillaryCapillaryCapillaryCapillary
Active phase HP-5HP-5Mega 5MSSPB-1DB-5
Column length (m) 30.30.30.30.30.
Carrier gas HeHeHeHeHe
Substrate
Column diameter (mm) 0.250.250.250.200.25
Phase thickness (μm) 0.250.250.250.200.25
Tstart (C) 60.60.40.70.70.
Tend (C) 280.280.240.220.230.
Heat rate (K/min) 3.3.3.3.4.
Initial hold (min)   2. 2.
Final hold (min)    15.20.
I 991.995.987.980.991.
ReferenceTsiri, Kretsi, et al., 2003Tzakou, Couladis, et al., 2003Verzera, Trozzi, et al., 2003Cavaleiro, Salgueiro, et al., 2002Choi, Kim. M.-S.L., et al., 2002
Comment MSDC-RI MSDC-RI MSDC-RI MSDC-RI MSDC-RI
Column type CapillaryCapillaryCapillaryCapillaryCapillary
Active phase SE-52DB-5DB-5DB-5HP-5
Column length (m) 25.30.30.30.30.
Carrier gas N2 HeHeN2
Substrate
Column diameter (mm) 0.320.250.250.250.25
Phase thickness (μm) 0.150.250.250.250.25
Tstart (C) 45.50.60.60.60.
Tend (C) 200.280.240.240.220.
Heat rate (K/min) 3.3.3.3.5.
Initial hold (min) 5.5.  10.
Final hold (min) 20.
I 993.991.992.993.992.
ReferenceDuru, Cakir, et al., 2002Economakis, Skaltsa, et al., 2002Flamini, Cioni, et al., 2002Flamini, Cioni, et al., 2002, 2Flamini, Cioni, et al., 2002, 3
Comment MSDC-RI MSDC-RI MSDC-RI MSDC-RI MSDC-RI
Column type CapillaryCapillaryCapillaryCapillaryCapillary
Active phase HP-5CP Sil 5 CBRTX-5 MSSE-30DB-5
Column length (m) 30.50.30.25.30.
Carrier gas  H2HeN2He
Substrate
Column diameter (mm) 0.250.250.250.250.25
Phase thickness (μm) 0.250.150.250.250.25
Tstart (C) 60.40.45.60.60.
Tend (C) 280.300.180.180.260.
Heat rate (K/min) 3.4.2.53.4.
Initial hold (min) 5.3.10.10.
Final hold (min)    10.
I 991.991.993.983.990.
ReferenceFokialakis, Magiatis, et al., 2002Heinrich, Pfeifhofer, et al., 2002Hudaib, Speroni, et al., 2002bin Jantan, Ayop, et al., 2002Javidnia, Miri, et al., 2002
Comment MSDC-RI MSDC-RI MSDC-RI MSDC-RI MSDC-RI
Column type CapillaryCapillaryCapillaryCapillaryCapillary
Active phase BP-1DB-5RTX-5HP-1CP Sil 5 CB
Column length (m) 50.25.30.24.25.
Carrier gas HeHeHeHeN2
Substrate
Column diameter (mm) 0.220.250.250.320.25
Phase thickness (μm) 0.25 0.250.170.25
Tstart (C) 60.70.45.60.60.
Tend (C) 220.260.300.250.280.
Heat rate (K/min) 2.4.3.4.4.
Initial hold (min)   6.2.6.
Final hold (min) 20. 10.20.
I 978.991.991.982.977.
ReferenceLota, de Rocca Serra, et al., 2002Miri, Ramezani, et al., 2002Mondello, Zappia, et al., 2002Nath, Sarma, et al., 2002Pino, Marbot, et al., 2002
Comment MSDC-RI MSDC-RI MSDC-RI MSDC-RI MSDC-RI
Column type CapillaryCapillaryCapillaryCapillaryCapillary
Active phase SPB-5CP Sil 5 CBDB-1HP-5RTX-5
Column length (m) 30.30.50.30.30.
Carrier gas HeH2HeHeHe
Substrate
Column diameter (mm) 0.250.250.220.250.25
Phase thickness (μm) 0.250.250.250.250.25
Tstart (C) 60.60.60.60.45.
Tend (C) 250.280.220.280.250.
Heat rate (K/min) 4.2.2.3.3.
Initial hold (min) 2.10.  6.
Final hold (min) 20.40.20.
I 991.981.980.963.991.
ReferencePino, Marbot, et al., 2002, 2Pino, Marbot, et al., 2002, 3Pintore, Usai, et al., 2002Pitarokili, Couladis, et al., 2002Shellie, Mondello, et al., 2002
Comment MSDC-RI MSDC-RI MSDC-RI MSDC-RI MSDC-RI
Column type CapillaryCapillaryCapillaryCapillaryCapillary
Active phase RTX-5HP-5HP-5Petrocol DHBP-1
Column length (m) 30.30.30.100.50.
Carrier gas HeHeHeHeHe
Substrate
Column diameter (mm) 0.250.250.250.250.22
Phase thickness (μm) 0.250.250.250.50.25
Tstart (C) 45.60.60.60.60.
Tend (C) 250.280.280.180.230.
Heat rate (K/min) 3.3.3.4.2.
Initial hold (min) 6.5.5.8.
Final hold (min)    2.35.
I 995.993.989.991.983.
ReferenceShellie, Mondello, et al., 2002Aligiannis, Kalpoutzakis, et al., 2001Aligiannis, Kalpoutzakis, et al., 2001, 2Alonzo, Saiano, et al., 2001Bianchini, Tomi, et al., 2001
Comment MSDC-RI MSDC-RI MSDC-RI MSDC-RI MSDC-RI
Column type CapillaryCapillaryCapillaryCapillaryCapillary
Active phase CP-Sil 8CB-MSSPB-1HP-5HP-5HP-5MS
Column length (m) 60.15.30.30.30.
Carrier gas   HeHeHe
Substrate
Column diameter (mm) 0.250.250.250.250.25
Phase thickness (μm) 0.250.250.250.250.25
Tstart (C) 40.35.60.60.60.
Tend (C) 280.225.260.380.280.
Heat rate (K/min) 4.6.3.3.3.
Initial hold (min) 2.3.  5.
Final hold (min)  10.10.
I 989.984.990.988.991.
ReferenceBruna, Hierro, et al., 2001Chisholm, Wilson, et al., 2001Couladis, Baziou, et al., 2001Couladis, Tsortanidou, et al., 2001Giamakis, Kretsi, et al., 2001
Comment MSDC-RI MSDC-RI MSDC-RI MSDC-RI MSDC-RI
Column type CapillaryCapillaryCapillaryCapillaryCapillary
Active phase HP-1HP-5RTX-5 MSRTX-5 MSSE-30
Column length (m) 60.50.30.30.25.
Carrier gas HeHeHeHeN2
Substrate
Column diameter (mm) 0.250.250.250.250.20
Phase thickness (μm) 0.250.250.250.25
Tstart (C) 50.50.70.70.60.
Tend (C) 250.250.210.210.180.
Heat rate (K/min) 2.52.54.4.3.
Initial hold (min) 5.5.10.10.10.
Final hold (min)   10.10.1.
I 983.991.993.993.990.
ReferenceGuilliard, Delgado, et al., 2001Guilliard, Delgado, et al., 2001Hudaib, Grazia Bellardi, et al., 2001Hudaib, Grazia Bellardi, et al., 2001bin Jantan, Basni, et al., 2001
Comment MSDC-RI MSDC-RI MSDC-RI MSDC-RI MSDC-RI
Column type CapillaryCapillaryCapillaryCapillaryCapillary
Active phase DB-1BP-1BP-1CP Sil 5 CBCP Sil 5 CB
Column length (m) 30.50.50.50.50.
Carrier gas  HeHeHeHe
Substrate
Column diameter (mm) 0.320.220.220.320.32
Phase thickness (μm) 0.250.250.250.40.4
Tstart (C) 40.60.60.60.60.
Tend (C) 240.220.220.280.280.
Heat rate (K/min) 7.2.2.3.3.
Initial hold (min)    10.10.
Final hold (min) 5.  60.60.
I 989.978.978.981.981.
ReferenceLin and Rouseff, 2001Lota, Serra, et al., 2001Lota, Serra, et al., 2001Pino and Marbot, 2001Pino, Marbot, et al., 2001
Comment MSDC-RI MSDC-RI MSDC-RI MSDC-RI MSDC-RI
Column type CapillaryCapillaryCapillaryCapillaryCapillary
Active phase BP-1BP-1HP-5MSHP-5HP-5MS
Column length (m) 50.50.30.30.30.
Carrier gas He HeHeHe
Substrate
Column diameter (mm) 0.220.220.250.250.25
Phase thickness (μm) 0.250.250.250.250.25
Tstart (C) 60.60.50.35.60.
Tend (C) 220.220.250.280.280.
Heat rate (K/min) 2.2.3.5.34.
Initial hold (min)     5.
Final hold (min) 20.20. 5.
I 981.979.990.991.3988.
ReferenceRezzi, Bighelli, et al., 2001Rezzi, Cavaleiro, et al., 2001Salido, Altarejos, et al., 2001Siegmund, Derler, et al., 2001Skaltsa, Mavrommati, et al., 2001
Comment MSDC-RI MSDC-RI MSDC-RI MSDC-RI MSDC-RI
Column type CapillaryCapillaryCapillaryCapillaryCapillary
Active phase BPX-5HP-5BP-1DB-5CP Sil 8 CB
Column length (m) 50.30.50.60.
Carrier gas H2He He
Substrate
Column diameter (mm) 0.220.200.220.25
Phase thickness (μm) 0.250.250.250.25
Tstart (C) 60.60.60.40.60.
Tend (C) 180.180.220.290.220.
Heat rate (K/min) 4.4.2.4.4.
Initial hold (min) 5.8. 2.5.
Final hold (min) 5.2.20.5.30.
I 994.994.979.982.989.
ReferenceZabaras and Wyllie, 2001Alonzo, Bosco, et al., 2000Baldovini, Ristorcelli, et al., 2000Bartley and Jacobs, 2000Chevance, Farmer, et al., 2000
Comment MSDC-RI MSDC-RI MSDC-RI MSDC-RI MSDC-RI
Column type CapillaryCapillaryCapillaryCapillaryCapillary
Active phase HP-5HP-5BP-1BP-1HP-101
Column length (m) 30.30.50.50.25.
Carrier gas HeHeHeHeHe
Substrate
Column diameter (mm) 0.250.250.220.220.2
Phase thickness (μm) 0.250.250.250.250.2
Tstart (C) 40.40.60.60.70.
Tend (C) 200.200.230.230.200.
Heat rate (K/min) 2.2.2.2.3.
Initial hold (min) 5.5.  2.
Final hold (min) 20.20.35.35.10.
I 990.990.978.978.986.
ReferenceKim, Thuy, et al., 2000Kim, Thuy, et al., 2000Lota, de Rocca Serra, et al., 2000Lota, de Rocca Serra, et al., 2000Milos and Radonic, 2000
Comment MSDC-RI MSDC-RI MSDC-RI MSDC-RI MSDC-RI
Column type CapillaryCapillaryCapillaryCapillaryCapillary
Active phase RTX-5SE-30CP Sil 5 CBHP-5HP-5
Column length (m) 10.50.50.30.30.
Carrier gas He H2HeHe
Substrate
Column diameter (mm) 0.10.20.220.250.25
Phase thickness (μm) 0.1 0.130.250.25
Tstart (C) 50.50.40.50.70.
Tend (C) 350.250.300.280.230.
Heat rate (K/min) 12.36.4.4.2.
Initial hold (min)    5.
Final hold (min)   10.
I 994.986.984.991.986.
ReferenceMondello, Zappia, et al., 2000Paramonov, Khalilova, et al., 2000Pfeifhofer, 2000Skaltsa, Lazari, et al., 2000Song, Sawamura, et al., 2000
Comment MSDC-RI MSDC-RI MSDC-RI MSDC-RI MSDC-RI
Column type CapillaryCapillaryCapillaryCapillaryCapillary
Active phase DB-5Mega 5MSMega 5MSCP Sil 8 CBCBP-1
Column length (m) 30.30.30.25.30.
Carrier gas N2HeHe He
Substrate
Column diameter (mm) 0.250.250.250.20.25
Phase thickness (μm) 0.250.250.250.25
Tstart (C) 70.40.40.40.60.
Tend (C) 230.240.240.200.240.
Heat rate (K/min) 2.3.3.2.4.
Initial hold (min)  2.2.8.
Final hold (min)
I 986.987.987.980.986.
ReferenceSong, Sawamura, et al., 2000, 2Verzera, la Rosa, et al., 2000Verzera, Trozzi, et al., 2000Yassaa, Meklati, et al., 2000Zunino, Lopez, et al., 2000
Comment MSDC-RI MSDC-RI MSDC-RI MSDC-RI MSDC-RI
Column type CapillaryCapillaryCapillaryCapillaryCapillary
Active phase CP Sil 8 CBDB-1BP-1BP-1BP-1
Column length (m) 50.60.50.50.50.
Carrier gas   HeHeHe
Substrate
Column diameter (mm) 0.320.320.220.220.22
Phase thickness (μm)  1.0.250.250.25
Tstart (C) 60.-50.60.60.60.
Tend (C) 220.175.230.230.220.
Heat rate (K/min) 4.6.2.2.2.
Initial hold (min) 5.2.
Final hold (min) 30. 35.35.20.
I 991.988.8978.978.979.
ReferenceChevance and Farmer, 1999Helmig, Klinger, et al., 1999Lota, Serra, et al., 1999Lota, Serra, et al., 1999Mazzoni, Tomi, et al., 1999
Comment MSDC-RI MSDC-RI MSDC-RI MSDC-RI MSDC-RI
Column type CapillaryCapillaryCapillaryCapillaryCapillary
Active phase OV-101DB-1DB-1HP-1OV-1
Column length (m) 25.60.30.60.25.
Carrier gas N2He He
Substrate
Column diameter (mm) 0.250.250.250.250.25
Phase thickness (μm)  0.250.250.250.3
Tstart (C) 50.50.50.50.50.
Tend (C) 200.220.220.250.200.
Heat rate (K/min) 5.4.3.2.53.
Initial hold (min)   3.5.1.
Final hold (min)     20.
I 987.985.980.991.986.
ReferenceMenut, Bessiere, et al., 1999Mirza and Sefidkon, 1999Muselli, Hoi, et al., 1999Stashenko, Cervantes, et al., 1999Bicchi, Rubiolo, et al., 1998
Comment MSDC-RI MSDC-RI MSDC-RI MSDC-RI MSDC-RI
Column type CapillaryCapillaryCapillaryCapillaryCapillary
Active phase DB-5BP-1BP-1Methyl SiliconeOV-1
Column length (m) 30.25.50. 25.
Carrier gas  HeHe H2
Substrate
Column diameter (mm) 0.250.320.22 0.25
Phase thickness (μm) 0.25 0.25 0.3
Tstart (C) 50.5.60.50.50.
Tend (C) 250.250.220.250.200.
Heat rate (K/min) 3.5.2.4.3.
Initial hold (min)  5.  1.
Final hold (min)  30.20. 20.
I 989.982.985.979.984.
ReferenceIsidorov, Zenkevich, et al., 1998Sinyinda and Gramshaw, 1998Tam, An, et al., 1998Analytical Methods Committee, 1997Bicchi, Fresia, et al., 1997
Comment MSDC-RI MSDC-RI MSDC-RI MSDC-RI MSDC-RI
Column type CapillaryCapillaryCapillaryCapillaryCapillary
Active phase BP-1DB-5DB-1Methyl SiliconeDB-1
Column length (m) 50.60.60.25.60.
Carrier gas HeHeHeHeH2
Substrate
Column diameter (mm) 0.220.240.250.20.25
Phase thickness (μm) 0.25 0.250.30.25
Tstart (C) 60.50.50.40.50.
Tend (C) 230.280.250.200.250.
Heat rate (K/min) 2.5.3.52.2.5
Initial hold (min)  3.5. 5.
Final hold (min) 35.
I 982.992.983.992.987.
ReferenceMariotti, Costa, et al., 1997Tzakou, Roussis, et al., 1997Stashenko, Prada, et al., 1996Píry, Príbela, et al., 1995Stashenko, Villa, et al., 1995
Comment MSDC-RI MSDC-RI MSDC-RI MSDC-RI MSDC-RI
Column type CapillaryCapillaryCapillaryCapillaryCapillary
Active phase DB-1DB-1CP Sil 5 CBHP-101OV-101
Column length (m) 60.60.25.50.50.
Carrier gas  HeHeN2N2
Substrate
Column diameter (mm) 0.320.250.220.250.25
Phase thickness (μm) 0.50.250.11
Tstart (C) 40.70.80.70.80.
Tend (C) 290.250.230.200.200.
Heat rate (K/min) 4.2.51.3.2.
Initial hold (min) 2.5.8.
Final hold (min) 5.15.16.
I 983.982.982.990.981.
ReferenceBartley and Foley, 1994Combariza, Tirado, et al., 1994Chanegriha and Baaliouamer, 1993Chung, Eiserich, et al., 1993Yang, Sugisawa, et al., 1992
Comment MSDC-RI MSDC-RI MSDC-RI MSDC-RI MSDC-RI
Column type CapillaryCapillaryCapillaryCapillaryCapillary
Active phase OV-101DB-1DB-5HP-1OV-101
Column length (m) 50.60.60.50.50.
Carrier gas N2 HeHeH2
Substrate
Column diameter (mm) 0.250.320.320.320.32
Phase thickness (μm)   1.1.05
Tstart (C) 80.50.40.40.50.
Tend (C) 200.250.220.230.200.
Heat rate (K/min) 2.4.3.2.2.
Initial hold (min)  0.1
Final hold (min)    40.
I 983.982.987.984.980.
ReferenceYang, Sugisawa, et al., 1992Flath, Light, et al., 1990Le Quere and Latrasse, 1990Tang, Zhang, et al., 1990Pieribattesti, Smadja, et al., 1988
Comment MSDC-RI MSDC-RI MSDC-RI MSDC-RI MSDC-RI
Column type CapillaryCapillaryCapillary
Active phase CP Sil 5 CBOV-1OV-1
Column length (m) 25.30.30.
Carrier gas N2HeHe
Substrate
Column diameter (mm) 0.220.50.5
Phase thickness (μm)  0.80.8
Tstart (C) 70.40.40.
Tend (C) 295.220.220.
Heat rate (K/min) 4.2.2.
Initial hold (min)
Final hold (min)
I 980.980.981.
ReferenceMontanarella, Bos, et al., 1986De Pooter, Omar, et al., 1985De Pooter, Omar, et al., 1985
Comment MSDC-RI MSDC-RI MSDC-RI

Normal alkane RI, non-polar column, custom temperature program

Data compiled by: NIST Mass Spectrometry Data Center, William E. Wallace, director

Column type CapillaryCapillaryCapillaryCapillaryCapillary
Active phase DB-5DB-1RTX-1RTX-1CP-Sil 5 CB
Column length (m) 30.30.60.60.50.
Carrier gas HeliumHydrogenHeliumHeliumNitrogen
Substrate
Column diameter (mm) 0.250.250.220.220.32
Phase thickness (μm) 0.250.250.250.251.20
Program not specified45 0C 3 0C/min -> 175 0C 15 0C/min -> 300 0C (10 min)not specifiednot specified36 0C 20 0C/min -> 85 0C 1 0C/min -> 145 0C 3 0C/min -> 250 0C (30 min)
I 988.975.980.980.982.
ReferenceRodriques, Amorim, et al., 2013Albano, Lima, et al., 2012Bendiabdellah, El Amine Dib, et al., 2012Bendiabdellah, El Amine Dib, et al., 2012Collin, Nizet, et al., 2012
Comment MSDC-RI MSDC-RI MSDC-RI MSDC-RI MSDC-RI
Column type CapillaryCapillaryCapillaryCapillaryCapillary
Active phase Mega-5DB-5 MSPolydimethyl siloxane with 5 % Ph groupsPolydimethyl siloxane with 5 % Ph groupsHP-5 MS
Column length (m) 25.30.  30.
Carrier gas HeliumHelium  Helium
Substrate
Column diameter (mm) 0.250.25  0.25
Phase thickness (μm) 0.250.25  0.25
Program not specified80 0C (1.5 min) 4 0C/min -> 180 0C 10 0C/min -> 300 0C (10 min)not specifiednot specified40 0C (10 min) 3 0C/min -> 200 0C 2 0C/min -> 220 0C
I 991.988.991.991.992.
ReferenceDell'Agli, Sanna, et al., 2012Fontes, Ramos, et al., 2012Robinson, Adams, et al., 2012Robinson, Adams, et al., 2012Sharopov, Sulaimonova, et al., 2012
Comment MSDC-RI MSDC-RI MSDC-RI MSDC-RI MSDC-RI
Column type CapillaryCapillaryCapillaryCapillaryCapillary
Active phase Polydimethyl siloxane with 5 % Ph groupsHP-5HP-5Siloxane, 5 % PhDB-5
Column length (m) 30.25.30. 30.
Carrier gas HeliumHydrogenNitrogen Helium
Substrate
Column diameter (mm) 0.250.320.35 0.25
Phase thickness (μm) 0.250.520.25 0.25
Program 50 0C 4 0C/min -> 200 0C (5 min) 20 0C/min -> 280 0Cnot specified60 0C 3 0C/min -> 210 0C 5 0C/min -> 250 0C (2 min)not specifiednot specified
I 988.991.992.978.992.
Referenceda Silva, de Souza, et al., 2012Velickovic, Ristic, et al., 2012Veres, Csupor-Loffler, et al., 2012VOC BinBase, 2012Cao, Li, et al., 2011
Comment MSDC-RI MSDC-RI MSDC-RI MSDC-RI MSDC-RI
Column type CapillaryCapillaryCapillaryCapillaryCapillary
Active phase 5 % Phenyl polydimethyl siloxaneOV-1DB-1CBP-5CP-Sil 5 CB
Column length (m)  30.30.30.50.
Carrier gas  HeliumHeliumHeliumNitrogen
Substrate
Column diameter (mm)  0.250.250.250.32
Phase thickness (μm)   0.250.251.20
Program not specified40 0C 2 0C/min -> 120 0C 10 0C/min -> 230 0C (15 min)50 0C (5 min) 3 0C/min -> 240 0C 15 0C/min -> 300 0C (3 min)60 0C 3 0C/min -> 246 0C 10 0C/min -> 270 0C (5 min)36 0C 20 0C/min -> 85 0C 1 0C/min -> 145 0C 3 0C/min -> 250 0C (30 min)
I 991.976.991.990.982.
ReferenceChaverri, Diaz, et al., 2011Chen and Li, 2011Fathi, Sahari, et al., 2011Fortes, Naves, et al., 2011Gros, Nizet, et al., 2011
Comment MSDC-RI MSDC-RI MSDC-RI MSDC-RI MSDC-RI
Column type CapillaryCapillaryCapillaryCapillaryCapillary
Active phase HP-5DB-5HP-5 MSHP-5 MSHP-5 MS
Column length (m) 30.60.30.
Carrier gas NitrogenHeliumHelium
Substrate
Column diameter (mm) 0.250.250.25
Phase thickness (μm) 0.251.000.25
Program 35 0C (10 min) 3 0C/min -> 205 0C 10 0C/min -> 225 0C40 0C 4 0C/min -> 230 0C 100 0C/min -> 260 0C (11.7 min)40 0C (10 min) 3 0C/min -> 200 0C 2 0C/min -> 220 0Cnot specifiednot specified
I 991.999.991.993.994.
ReferenceLaribi, Kouki, et al., 2011Miyazaki, Plotto, et al., 2011Nance and Setzer, 2011Payo, Colo, et al., 2011Payo, Colo, et al., 2011
Comment MSDC-RI MSDC-RI MSDC-RI MSDC-RI MSDC-RI
Column type CapillaryCapillaryCapillaryCapillaryCapillary
Active phase HP-5 MSPolydimethyl siloxane, 5 % phenylZB-5HP-5 MSHP-5 MS
Column length (m)   30.30.30.
Carrier gas   NitrogenHeliumHelium
Substrate
Column diameter (mm)   0.250.250.25
Phase thickness (μm)   0.250.250.25
Program not specifiednot specifiednot specified50 0C (1.5 min) 10 0C/min -> 180 0C (2 min) 6 0C/min -> 280 0C (10 min)50 0C (2 min) 3 0C/min -> 130 0C (2 min) 5 0C/min -> 270 0C
I 994.978.993.978.992.
ReferencePayo, Colo, et al., 2011Skogerson, Wohlgemuth, et al., 2011Vazquez, Demmel, et al., 2011Wang, Xu, et al., 2011Bamoniri, Mirjalili, et al., 2010
Comment MSDC-RI MSDC-RI MSDC-RI MSDC-RI MSDC-RI
Column type CapillaryCapillaryCapillaryCapillaryCapillary
Active phase RTx-1RTX-1CP-Sil 8 CBHP-5 MSSLB-5 MS
Column length (m) 60.60.30.30.10.
Carrier gas HeliumHeliumHeliumHeliumHelium
Substrate
Column diameter (mm) 0.220.220.250.320.10
Phase thickness (μm) 0.250.250.250.250.10
Program not specifiednot specifiedMulti-rise programnot specifiednot specified
I 981.981.991.991.991.
ReferenceDib, Bendahou, et al., 2010Dib, Djabou, et al., 2010Di Giusto, Bessiere, et al., 2010Pino, Marquez, et al., 2010Scandinaro, Tranchida, et al., 2010
Comment MSDC-RI MSDC-RI MSDC-RI MSDC-RI MSDC-RI
Column type CapillaryCapillaryCapillaryCapillaryCapillary
Active phase DB-5HP-5 MSDB-1-MSDB-1ZB-1 MS
Column length (m) 30.30.60.30.30.
Carrier gas HeliumHeliumHeliumHeliumHelium
Substrate
Column diameter (mm) 0.250.250.250.250.25
Phase thickness (μm) 0.250.250.250.250.25
Program not specified50 0C (3 min) 3 0C/min -> 160 0C (10 min) 3 0C/min -> 240 0Cnot specifiednot specified50 0C 3 0C/min -> 150 0C (10 min) 10 0C/min -> 250 0C
I 991.990.981.990.958.
ReferenceScherer, Wagner, et al., 2010Sharifiar, Yassa, et al., 2010Takeoka, Hobbs, et al., 2010Xu, Tang, et al., 2010Bajpai, Al-Reza, et al., 2009
Comment MSDC-RI MSDC-RI MSDC-RI MSDC-RI MSDC-RI
Column type CapillaryCapillaryCapillaryCapillaryCapillary
Active phase DB-5DB-1 HP-5 MSOptima-5MS
Column length (m) 30.60. 30.30.
Carrier gas HeliumHelium HeliumHelium
Substrate
Column diameter (mm) 0.250.25 0.250.32
Phase thickness (μm) 0.250.25 0.250.25
Program 50 0C m6 0C/min -> 140 0C 5 0C/min -> 160 0C (1 min) 10 0C/min -> 200 0C50 0C (5 min) 3 0C/min -> 120 0C 5 0C/min -> 250 0C (3 min) 15 0C/min -> 300 0C (20 min)not specified40 0C (3 min) 3 0C/min -> 160 0C (2 min) 8 0C/min -> 220 0C (3 min)40 0C (5 min) 5 0C/min -> 230 0C 30 0C/min -> 280 0C (5 min)
I 992.986.989.993.976.
ReferenceCourtois, Paine, et al., 2009Delort and Jaquier, 2009Entezari, Hashemi, et al., 2009Fan, Lu, et al., 2009HEuskin, Godin, et al., 2009
Comment MSDC-RI MSDC-RI MSDC-RI MSDC-RI MSDC-RI
Column type CapillaryCapillaryCapillaryCapillaryCapillary
Active phase 5 % Phenyl methyl siloxaneElite-5 MSHP-5 MSRTX-5RTX-5
Column length (m) 30.30.30.30.30.
Carrier gas HeliumHeliumHeliumNitrogenNitrogen
Substrate
Column diameter (mm) 0.250.250.250.250.25
Phase thickness (μm) 0.250.250.250.250.25
Program 50 0C (2 min) 10 0C/min -> 150 0C 15 0C/min -> 300 0C (10 min)60 0C (1 min) 1.5 0C/min -> 185 0C (1 min) 9 0C/min -> 275 0C (2 min)50 0C (5 min) 6 0C/min -> 125 0C 10 0C/min -> 170 0C60 0C 95 min) 110 0C 3 0C/min -> 200 0C 5 0C/min -> 220 0C 95 min)not specified
I 991.984.990.993.991.
ReferenceHuang, Qin, et al., 2009Kapoor, Singh, et al., 2009Keefover-Ring, Thompson, et al., 2009Leela, Vipin, et al., 2009Leela, Vipin, et al., 2009
Comment MSDC-RI MSDC-RI MSDC-RI MSDC-RI MSDC-RI
Column type CapillaryCapillaryCapillaryCapillaryCapillary
Active phase HP-5 MSDB-1DB-1DB-5DB-5
Column length (m) 30.30.30.30.30.
Carrier gas HeliumHydrogenHydrogenHeliumHelium
Substrate
Column diameter (mm) 0.250.250.250.250.25
Phase thickness (μm) 0.250.250.250.250.25
Program 40 0C (5 min) 2 0C/min -> 270 0C -> 260 0C (20 min)45 0C 3 0C/min -> 175 0C 15 0C/min -> 300 0C (10 min)45 0C 3 0C/min -> 175 0C 15 0C/min -> 300 0C (10 min)not specifiednot specified
I 993.975.975.992.995.
ReferenceMancini, Arnold, et al., 2009Mendes, Trindade, et al., 2009Mendes, Trindade, et al., 2009, 2Porto, Decorti, et al., 2009Porto, Decorti, et al., 2009
Comment MSDC-RI MSDC-RI MSDC-RI MSDC-RI MSDC-RI
Column type CapillaryCapillaryCapillaryCapillaryCapillary
Active phase HP-5DB-5 MSDB-1 HTDB-5OV-1
Column length (m) 30.30.30.30.30.
Carrier gas  HeliumHeliumHeliumHelium
Substrate
Column diameter (mm) 0.320.250.320.250.25
Phase thickness (μm)  0.250.100.25
Program not specifiednot specified40 0C 2 0C/min -> 100 0C 5 0C/min -> 230 0C (5 min)50 0C 95 min) 3 0C/min -> 100 0C 4 0C/min -> 160 0C 5 0C/min -> 220 0C (15 min)40 0C 2 0C/min -> 130 0C (5 min) 10 0C/min -> 230 0C (15 min)
I 991.990.978.990.976.
ReferenceRiahi, Pourbasheer, et al., 2009Su, Wang, et al., 2009Yang, Kim, et al., 2009Yang, Yang, et al., 2009Yu, Li, et al., 2009
Comment MSDC-RI MSDC-RI MSDC-RI MSDC-RI MSDC-RI
Column type CapillaryCapillaryCapillaryCapillaryCapillary
Active phase HP-5 MSDB-5SLB-5 MSSLB-5 MSHP-5
Column length (m) 30.30.30.30.30.
Carrier gas HeliumHeliumHeliumHeliumHelium
Substrate
Column diameter (mm) 0.250.250.250.250.25
Phase thickness (μm) 0.250.250.250.250.25
Program 32 0C (1 min) 50 0C/min -> 115 0C 1.5 0C/min -> 145 0C 12 0C/min -> 240 0C (10 min)not specified50 0C 3 0C/min -> 250 0C (1 min) 10 0C/min -> 300 0C (5 min)not specifiednot specified
I 992.991.991.988.991.
ReferenceZellner, Amorim, et al., 2009Bastos, Ishimoto, et al., 2008Costa, De Fina, et al., 2008Costa, De Fina, et al., 2008Isidorov, Lech, et al., 2008
Comment MSDC-RI MSDC-RI MSDC-RI MSDC-RI MSDC-RI
Column type CapillaryCapillaryCapillaryCapillaryCapillary
Active phase CB-1CB-1CP Sil 8 CBSLB-5 MSHP-5MS
Column length (m) 30.30.50.30.30.
Carrier gas HeliumHeliumHeliumHeliumHe
Substrate
Column diameter (mm) 0.250.250.320.250.25
Phase thickness (μm) 0.250.250.250.250.25
Program 40 0C (2 min) 4 0C/min -> 180 0C 20 0C/min -> 220 0C (1 min)not specifiednot specifiednot specified40 0C (2 min) 3 0C/min -> 180 0C (2 min) 15 0C -> 280 0C
I 990.987.991.991.993.
ReferenceKannaste, Vongvanich, et al., 2008Kannaste, Vongvanich, et al., 2008Kupcinskiene, Stikliene, et al., 2008Lo Presti, Sciarrone, et al., 2008Ning, Zheng, et al., 2008
Comment MSDC-RI MSDC-RI MSDC-RI MSDC-RI MSDC-RI
Column type CapillaryCapillaryCapillaryCapillaryCapillary
Active phase DB-1CP-Sil 8CB-MSHP-5HP-5Elite-1
Column length (m) 30.30.30.30.30.
Carrier gas HeHeliumHeliumHeliumHelium
Substrate
Column diameter (mm) 0.250.250.250.250.32
Phase thickness (μm) 0.250.250.250.250.25
Program 45C => 3C/min => 175C => 15C/min => 300C (10min)50 0C(3 min) 3 0C/min -> 100 0C 2.7 0C/min -> 140 0C 2.4 0C/min -> 180 0C 6 0C/min -> 260 0C40 0C (3 min) 3 0C/min -> 160 0C (2 min) 8 0C/min -> 220 0C (3 min)not specifiednot specified
I 975.990.991.994.991.
ReferenceNogueira, Marcelo-Curto, et al., 2008Profitt, Schatz, et al., 2008Qiao, Xie, et al., 2008Qiao, Xie, et al., 2008Raj, Baby, et al., 2008
Comment MSDC-RI MSDC-RI MSDC-RI MSDC-RI MSDC-RI
Column type CapillaryCapillaryCapillaryCapillaryCapillary
Active phase BPX-5DB-5 MSRTX-5RTX-55 % Phenyl methyl siloxane
Column length (m) 7.530.30.30.
Carrier gas Helium HeliumHelium
Substrate
Column diameter (mm) 0.100.250.250.25
Phase thickness (μm) 10.0.250.250.25
Program not specified80 0C (1.5 min) 4 pC/min -> 180 0C 10 0C/min -> 300 0C (10 min)60 0C (5 min) 5 0C/min -> 110 0C 3 0C/min -> 220 0C (5 min)not specifiednot specified
I 991.989.993.991.994.
ReferenceShellie, 2008Silva, Doria, et al., 2008Zachariah, Leela, et al., 2008Zachariah, Leela, et al., 2008Agabriel, Cornu, et al., 2007
Comment MSDC-RI MSDC-RI MSDC-RI MSDC-RI MSDC-RI
Column type CapillaryCapillaryCapillaryCapillaryCapillary
Active phase DB-5DB-1DB-5MSCBP-5HP-5MS
Column length (m) 30.30.30.30.30.
Carrier gas HeHeHeHeHe
Substrate
Column diameter (mm) 0.250.250.250.250.25
Phase thickness (μm) 0.10.10.250.250.25
Program 35C => 4C/min => 180C => 10C/min => 250C35C => 4C/min => 180C => 10C/min => 250C60C => 1C/min => 65C => 3C/min => 120C => 5C/min => 180C(5min) => 5C/min => 250C (20min)60C(2min) => 3C/min => 240C => 10C/min => 300C40C => 3C/min => 100C => 5C/min => 230C(2min)
I 993.991.988.987.993.
ReferenceAlbuquerque M.R.J.R., Costa S.M.O., et al., 2007Albuquerque, Vasconcelos Silva, et al., 2007Barra A., Coroneo V., et al., 2007Cheriti, Saad, et al., 2007Chokeprasert P., Charles A.L., et al., 2007
Comment MSDC-RI MSDC-RI MSDC-RI MSDC-RI MSDC-RI
Column type CapillaryCapillaryCapillaryCapillaryCapillary
Active phase HP-5MSHP-5DB-1HP-5MSDB-1
Column length (m) 30.30.30.30.30.
Carrier gas He HeHeH2
Substrate
Column diameter (mm) 0.250.250.250.250.25
Phase thickness (μm) 0.250.250.250.250.25
Program 40C(10min) => 3C/min => 200C => 2C/min => 220C75C(4min) => 5C/min => 135C => 1C/min => 220C => 10C/min => 280C45C => 3C/min => 175C => 15C/min => 300C (10min)40C(5min) => 2C/min => 250C(15min) => 10C/min => 270C45 0C 3 0C/min -> 175 0C 15 0C/min -> 300 0C (10 min)
I 992.993.975.993.975.
ReferenceCole, Haber, et al., 2007Duschatzky, Almeida, et al., 2007Ferreira, Meireles de Sousa, et al., 2007Formisano, Mignola, et al., 2007Kamatou, Viljoen, et al., 2007
Comment MSDC-RI MSDC-RI MSDC-RI MSDC-RI MSDC-RI
Column type CapillaryCapillaryCapillaryCapillaryCapillary
Active phase HP-5MSCP Sil 8 CBHP-1CP Sil 8 CBHP-5MS
Column length (m) 30.30.30.50.30.
Carrier gas HeHeHeHeHe
Substrate
Column diameter (mm) 0.250.250.20.320.25
Phase thickness (μm) 0.250.250.330.250.25
Program 40C(3min) => 8C/min => 160C => 15C/min => 300C (10min)50C(3min) => 3C/min => 100C => 2.7C/min => 140C => 2.4C/min => 180C => 6C/min => 250C60C(5min) => 3C/min => 180C => 20C/min => 280C(10min)60 0C (2 min) 5 0C/min -> 160 0C 5 0C/min -> 250 0C (10 min)40C(10min) => 3C/min => 200C => 2C/min => 220C
I 995.989.991.991.992.
ReferenceLiu, Song, et al., 2007Meekijjaroenroj, Bessière, et al., 2007Merle, Verdeguer, et al., 2007Mockute, Bernotiene, et al., 2007Moronkola, Ogunwande, et al., 2007
Comment MSDC-RI MSDC-RI MSDC-RI MSDC-RI MSDC-RI
Column type CapillaryCapillaryCapillaryCapillaryCapillary
Active phase BPX-5DB-5CP-SilCP-SilCP-Sil
Column length (m) 30.30.30.30.30.
Carrier gas HeHydrogenHeliumHeliumHelium
Substrate
Column diameter (mm) 0.250.250.250.250.25
Phase thickness (μm) 0.250.250.250.250.25
Program 50C => 3C/min => 150C(10min) => 10C/min => 250Cnot specified50 0C (3 min) 3 0C/min -> 100 0C 2.7 0C/min -> 140 0C 2.4 0C/min -> 180 0C 6 0C/min -> 250 0C50 0C (3 min) 3 0C/min -> 100 0C 2.7 0C/min -> 140 0C 2.4 0C/min -> 180 0C 6 0C/min -> 250 0C50 0C (3 min) 3 0C/min -> 100 0C 2.7 0C/min -> 140 0C 2.4 0C/min -> 180 0C 6 0C/min -> 250 0C
I 994.991.981.990.990.
ReferenceOzer H., Sokmen M., et al., 2007Pontes, de Olivera, et al., 2007Proffit, 2007Proffit, 2007Proffit, 2007
Comment MSDC-RI MSDC-RI MSDC-RI MSDC-RI MSDC-RI
Column type CapillaryCapillaryCapillaryCapillaryCapillary
Active phase CP Sil 8 CBDB-1DB-55 % Phenyl methylsiloxaneHP-5 MS
Column length (m) 50.30.30. 30.
Carrier gas HeliumHeHydrogen Helium
Substrate
Column diameter (mm) 0.320.250.25 0.25
Phase thickness (μm) 0.250.250.25
Program 60 0C (2 min) 5 0C/min -> 160 0C (1 min) 10 0C/min -> 280 0C (3 min)45C => 3C/min => 175C => 15C/min => 300C(10min)35 0C 4 0C/min -> 180 0C 17 0C/min -> 280 0C (10 min)not specified40 0C (10 min) 3 oC/min -> 200 0C 2 0C/min -> 220 0C
I 991.975.991.993.993.
ReferenceRadusiene, Judzentiene, et al., 2007Rodrigues, Antunes, et al., 2007Santos, Santiago, et al., 2007Serrano, Cornu, et al., 2007Setzer, Stokes, et al., 2007
Comment MSDC-RI MSDC-RI MSDC-RI MSDC-RI MSDC-RI
Column type CapillaryCapillaryCapillaryCapillaryCapillary
Active phase HP-5MSHP-5MSDB-5SPB-5HP-5MS
Column length (m) 30.30.30.60.30.
Carrier gas HeHeHeHeHe
Substrate
Column diameter (mm) 0.250.250.250.320.25
Phase thickness (μm)  0.250.251.0.25
Program 40C(10min) => 3C/min => 200C => 2C/min => 220C40C(3min) => 6C/min => 160C => 10C/min => 300C (10min)35C => 4C/min => 180C => 10C/min => 250C60C => 1C/min => 130C => 2C/min => 200C => 4C/min => 250C (40min)50C(2min) => 6C/min => 200C => 10C/min => 270C(10min)
I 995.991.981.985.992.
ReferenceTakaku, Haber, et al., 2007Yu, Huang, et al., 2007Albuquerque, Canuto, et al., 2006Chemat, Lucchesi, et al., 2006Deng, Xu, et al., 2006
Comment MSDC-RI MSDC-RI MSDC-RI MSDC-RI MSDC-RI
Column type CapillaryCapillaryCapillaryCapillaryCapillary
Active phase DB-1HP-5HP-5SPB-5CP Sil 8 CB
Column length (m) 30.30.30.60.50.
Carrier gas He  HeHe
Substrate
Column diameter (mm) 0.250.250.250.320.32
Phase thickness (μm) 0.250.250.251.0.25
Program 45C => 3C/min => 175C => 15C/min => 300C (10min)>2.5C/min => 180C => 100C/min => 250C (7.3min)>2.5C/min => 180C => 100C/min => 250C (7.3min)60C => 1C/min => 130C => 2C/min => 200C => 4C/min => 250C(40min)60C(2min) => 5C/min => 160C(1min) => 10C/min => 250C (5min)
I 975.972.976.985.991.
ReferenceFigueiredo A.C., Barroso J.G., et al., 2006Goodner, Mahattanatawee, et al., 2006Goodner, Mahattanatawee, et al., 2006Iriti, Colnaghi, et al., 2006Judzentiene and Buzelyte, 2006
Comment MSDC-RI MSDC-RI MSDC-RI MSDC-RI MSDC-RI
Column type CapillaryCapillaryCapillaryCapillaryCapillary
Active phase HP-5DB-1SPB-5BPX-5DB-5
Column length (m) 30.30.30.30.30.
Carrier gas HeliumHeHeliumHeHe
Substrate
Column diameter (mm) 0.320.250.250.250.25
Phase thickness (μm) 0.25 0.100.250.25
Program not specified35C => 4C/min => 180C => 10C/min => 250C40 0C (1 min) 10 0C/min -> 120 0C 0.5 0C/min -> 150 0C 20 0C/min -> 280 0C (5 min)50C => 3C/min => 150C (10min) => 10C/min => 250C35C => 4C/min => 180C => 10C/min => 250C
I 988.991.991.993.992.
ReferenceKucuk, Gulec, et al., 2006de Lima, Maia, et al., 2006Navickiene, Morandim, et al., 2006Ozer H., Kilic H., et al., 2006Santos, Nunes, et al., 2006
Comment MSDC-RI MSDC-RI MSDC-RI MSDC-RI MSDC-RI
Column type CapillaryCapillaryCapillaryCapillaryCapillary
Active phase HP-5 MSHP-5MSHP-5MSHP-5MSDB-5
Column length (m) 30.30.30.30.30.
Carrier gas HeliumHeHeHeHe
Substrate
Column diameter (mm) 0.250.250.250.320.32
Phase thickness (μm) 0.250.250.250.250.25
Program 40 0C (10 min) 3 0C/min -> 200 0C 2 0C/min -> 220 0C40C(5min) => 2C/min => 250C (15min) => 10C/min => 270C60C => 1.5C/min => 185C(1min) => 9C/min => 275C(2min)60C(1min) => 1.5C => 185C => 9C/min => 275C (2min)60C => 2C/min => 100C => 3C/min => 160C => 5C/min => 280C
I 995.993.992.993.992.
ReferenceSchmidt, Noletto, et al., 2006Senatore, Apostolides Arnold, et al., 2006Singh, Marimuthu, et al., 2006Singh G., Maurya S., et al., 2006Srivastava, Mallavarapu, et al., 2006
Comment MSDC-RI MSDC-RI MSDC-RI MSDC-RI MSDC-RI
Column type CapillaryCapillaryCapillaryCapillaryCapillary
Active phase SE-52DB-5MSDB-1DB-5MSDB-1
Column length (m) 30.30.30.30.30.
Carrier gas HeHeHe He
Substrate
Column diameter (mm) 0.320.250.250.250.25
Phase thickness (μm) 0.150.250.250.250.25
Program 45C => 1C/min => 100C => 5C/min => 250C (10min)60C => 3C/min => 180C => 250C (2min)35C => 2C/min => 200C => 5C/min => 240C70C(2min) => 10C/min => 150C(15min) => 5C/min => 240C45C => 3C/min => 175C => 15C/min => 300C(10min)
I 991.988.980.1007.975.
ReferenceTognolini, Barocelli, et al., 2006Tuberoso, Barra, et al., 2006Al-Burtamani, Fatope, et al., 2005Bagci and Baser, 2005Belhattab, Larous, et al., 2005
Comment MSDC-RI MSDC-RI MSDC-RI MSDC-RI MSDC-RI
Column type CapillaryCapillaryCapillaryCapillaryCapillary
Active phase CP Sil 8 CBDB-5HP-5MSBP-5BP-5
Column length (m) 50.30.30.25.25.
Carrier gas HeHeHeHeliumHelium
Substrate
Column diameter (mm) 0.320.250.250.320.32
Phase thickness (μm) 0.250.250.250.500.50
Program 50C(5min) => 2C/min => 90C => 15C/min => 240C(4min)35C => 4C/min => 180C => 10C/min => 250C50C => 8C/min => 200C => 10C/min => 270C (5min)60 0C 6 0C/min -> 210 0C 10 0C/min -> 290 0C (10 min)not specified
I 991.988.5991.992.991.
ReferenceButkienë, Nivinskienë, et al., 2005Cysne, Canuto, et al., 2005Deng, Yao, et al., 2005Eyres, Dufour, et al., 2005Eyres, Dufour, et al., 2005
Comment MSDC-RI MSDC-RI MSDC-RI MSDC-RI MSDC-RI
Column type CapillaryCapillaryCapillaryCapillaryCapillary
Active phase DB-1DB-1DB-5HP-5CP-Sil5 CB MS
Column length (m) 30.30.30.50.50.
Carrier gas HeHeHeHe
Substrate
Column diameter (mm) 0.250.250.250.20.32
Phase thickness (μm) 0.250.250.250.51.2
Program 45C => 3C/min => 175C => 15C/min => 300C (10min)45C => 3C/min => 175C => 15C/min => 300C (10min)40C(1min) => 9C/min => 130C => 2C/min => 230C40C(1min) => 5C/min => 210C => 20C/min => 250C(8min)36C(2min) => 20C/min => 85C => 1C/min => 145C => 3C/min => 250C(30min)
I 975.975.994.986.984.
ReferenceFaleio, Miguel, et al., 2005Figueiredo, Sim-Sim, et al., 2005Hamm, Bleton, et al., 2005Himanen, Vuorinen, et al., 2005Iraqi, Vermeulen, et al., 2005
Comment MSDC-RI MSDC-RI MSDC-RI MSDC-RI MSDC-RI
Column type CapillaryCapillaryCapillaryCapillaryCapillary
Active phase BPX-5BPX-5CP Sil 8 CBHP-5MSDB-1
Column length (m) 30.30.50.30.
Carrier gas HeHeHe
Substrate
Column diameter (mm) 0.250.320.320.25
Phase thickness (μm) 0.250.50.250.25
Program 50C => 3C/min => 150C (10min) => 10C/min => 250C60C(1min) => 3.5C/min => 180C => 20C/min => 280C(2min)60C(1min) => 5C/min => 160C => 5C/min => 250C(3min)40C(5min) => 3C/min => 90C => 10C/min => 280Cnot specified
I 989.991.991.992.989.
ReferenceKordali, Kotan, et al., 2005Koutsoudaki, Krsek, et al., 2005Nivinskienë, Butkienë, et al., 2005Novak, Draxler, et al., 2005Omidbaigi and Bastan, 2005
Comment MSDC-RI MSDC-RI MSDC-RI MSDC-RI MSDC-RI
Column type CapillaryCapillaryCapillaryCapillaryCapillary
Active phase BPX-5CP Sil 8 CBHP-5DB-5DB-5
Column length (m) 30.50.30.30.30.
Carrier gas HeHe HeHe
Substrate
Column diameter (mm) 0.250.320.320.320.25
Phase thickness (μm) 0.250.25 0.250.1
Program 50C => 3C/min => 150C(10min) => 10C/min => 250C60C(2min) => 5C/min => 160C(1min) => 10C/min => 250C (3min)65C(1min) => 1C/min => 75C (2min) => 0.5C/min => 81C(2min) => 3C/min => 180C(7min)40 0C (2 min) 6 K/min -> 190 0C 12 K/min -> 240 0C35C => 4C/min => 180C => 10C/min => 250C
I 994.991.993.991.979.
ReferenceÖzer, Sahín, et al., 2005Radudienë, Judpintienë, et al., 2005Singh, Maurya, et al., 2005Steinhaus and Schieberle, 2005Albuquerque, Souza, et al., 2004
Comment MSDC-RI MSDC-RI MSDC-RI MSDC-RI MSDC-RI
Column type CapillaryCapillaryCapillaryCapillaryCapillary
Active phase DB-5DB-5CP Sil 8 CBDB-1CP Sil 5 CB
Column length (m) 30.30.50.30.50.
Carrier gas HeHeHeHe
Substrate
Column diameter (mm) 0.250.250.320.250.32
Phase thickness (μm) 0.250.10.25 1.2
Program 35C => 4C/min => 180C => 10C/min => 280C35C => 4C/min => 180C => 20C/min => 280C50C(5min) => 2C/min => 90C => 15C/min => 240C(4min)35C => 4C/min => 180C => 10C/min => 250C36C => 20C/min => 85C => 1C/min => 145C => 3C/min => 250C(30min)
I 991.991.991.991.982.
Referencede Andrade, Bezerra, et al., 2004Barros-Filho, Nunes, et al., 2004Butkienë, Nivinskienë, et al., 2004Cavalcanti, de Morais, et al., 2004Counet, Ouwerx, et al., 2004
Comment MSDC-RI MSDC-RI MSDC-RI MSDC-RI MSDC-RI
Column type CapillaryCapillaryCapillaryCapillaryCapillary
Active phase Methyl SiliconeOV-1OV-1DB-5CP Sil 8 CB
Column length (m)  15.30.30.50.
Carrier gas  HeHeHeHe
Substrate
Column diameter (mm)  0.3170.250.250.32
Phase thickness (μm)   0.250.25
Program not specified50C(4min) => 4C/min => 90C => 10C/min => 300C(10min)45 0C (4 min) 3 0C/min -> 75 0C 4 0C/min -> 115 0C 6 0C/min -> 312 0C40C(1min) => 9C/min => 130C => 2C/min => 230C60C(2min) => 5C/min => 160C (1min) => 10C/min => 250C (2min)
I 998.983.981.994.991.
ReferenceCouladis, Özcan, et al., 2004El-Shazly and Hussein, 2004Hafez and Abdel-Salam, 2004Hamm, Bleton, et al., 2004Judpentienë and Mockutë, 2004
Comment MSDC-RI MSDC-RI MSDC-RI MSDC-RI MSDC-RI
Column type CapillaryCapillaryCapillaryCapillaryCapillary
Active phase CP Sil 8 CBBPX-5DB-5DB-1CP Sil 8 CB
Column length (m) 50.30. 30.50.
Carrier gas HeH2 HeHe
Substrate
Column diameter (mm) 0.320.25 0.250.32
Phase thickness (μm) 0.250.25 0.25
Program 60C(2min) => 5C/min => 160C(1min) => 10C/min => 250C (5min)50 0C (1 min) 3 0C/min -> 150 0C 5 0C/min -> 250 0C (5 min)not specified45C => 3C/min => 175C => 15C/min => 300C (10min)50 0C (2 min) 3 0C/min -> 180 0C (1 min) 20 0C/min -> 250 0C (2 min)
I 991.991.991.975.991.
ReferenceJudpentienë and Mockutë, 2004, 2Koba, Sanda, et al., 2004Lo Cantore, Iacobellis, et al., 2004Miguel, Simões, et al., 2004Mockutë, Bernotienë, et al., 2004
Comment MSDC-RI MSDC-RI MSDC-RI MSDC-RI MSDC-RI
Column type CapillaryCapillaryCapillaryCapillaryCapillary
Active phase CP Sil 8 CBMDN-5HP-5HP-5MSHP-5MS
Column length (m) 50.30.30.30.30.
Carrier gas HeHelium  He
Substrate
Column diameter (mm) 0.320.250.250.250.25
Phase thickness (μm) 0.250.250.250.250.25
Program 50C(2min) => 3C/min => 180C(1min) => 20C/min => 250C (2min)30 0C (1 min) ballistically -> 60 0C 2 0C/min -> 120 0C 5 0C/min -> 280 0C (5 min)40C(5min) => 2C/min => 250C(15min) => 10C/min => 270C60C(1min) => 1.5C/min => 185C(1min) => 9C/min => 275C(2min)60C(1min) => 0.5C/min => 85C(1min) => 1C/min => 105C (2min) => 10C/min => 275C(2min)
I 991.992.993.993.993.
ReferenceMockutë, Judbentienë, et al., 2004Moretti, Madonia, et al., 2004Senatore, Apostolides Arnold, et al., 2004Singh, Marimuthu, et al., 2004Singh, Maurya, et al., 2004
Comment MSDC-RI MSDC-RI MSDC-RI MSDC-RI MSDC-RI
Column type CapillaryCapillaryCapillaryCapillaryCapillary
Active phase HP-5DB-5SE-30SE-30SE-54
Column length (m) 30.   30.
Carrier gas He
Substrate
Column diameter (mm) 0.25   0.32
Phase thickness (μm) 0.25   0.25
Program 50C (3min) => 3C/min => 150C (10min) => 10C/min => 250Cnot specifiednot specifiednot specified35C (2min) => 40C/min => 50C (2min) => 6C/min => 180C => 10C/min => 230C (10min)
I 991.991.983.981.992.
ReferenceTepe, Donmez, et al., 2004Vilaseca, Guy, et al., 2004Vinogradov, 2004Vinogradov, 2004Buettner, Mestres, et al., 2003
Comment MSDC-RI MSDC-RI MSDC-RI MSDC-RI MSDC-RI
Column type CapillaryCapillaryCapillaryCapillaryCapillary
Active phase Methyl SiliconeDB-1HP-5DB-5HP-5
Column length (m)  30.30.30.30.
Carrier gas HeHeHeHe
Substrate
Column diameter (mm)  0.250.250.250.25
Phase thickness (μm)  0.250.250.250.25
Program 60 0C 3 0C/min -> 200 0C 15 0C/min -> 250 0C (5 min)45C => 3C/min => 175C => 15C/min => 300C (10min)50C(3min) => 3C/min => 150C(10min) => 10 C/min => 250C40C (1min) => 9C/min => 130C => 2C/min => 230C40C(6min) => 2.5C/min => 150C => 90C/min => 250C
I 989.975.991.994.989.
ReferenceDemyttenaere, Morina, et al., 2003Faleiro, Miguel, et al., 2003Güllüce, Sökmen, et al., 2003Hamm, Lesellier, et al., 2003Jordán, Margaría, et al., 2003
Comment MSDC-RI MSDC-RI MSDC-RI MSDC-RI MSDC-RI
Column type CapillaryCapillaryCapillaryCapillaryCapillary
Active phase HP-5CP-Sil 8CB-MSCP Sil 8 CBCP Sil 8 CBHP-5
Column length (m) 30.50.50.50.30.
Carrier gas  HeHeHeHe
Substrate
Column diameter (mm) 0.250.320.320.320.25
Phase thickness (μm) 0.25 0.250.250.25
Program 40C(6min) => 2.5C/min => 150C => 90C/min => 250C50C(2min) => 3C/min => 180C(1min) => 20C/min => 250C(2min)70C(5min) => 3C/min => 100C (1min) => 25C/min => 250C (10min)60C(1min) => 5C/min => 160C => 10C/min => 250C(5min)60C(5min) => 1C/min => 140C => 10C/min => 270C(5min)
I 980.991.991.991.993.
ReferenceJordán, Margaría, et al., 2003Mockute, Bernotiene, et al., 2003Mockute and Judzentiene, 2003Mockute, Nivinskiene, et al., 2003Singh, Singh, et al., 2003
Comment MSDC-RI MSDC-RI MSDC-RI MSDC-RI MSDC-RI
Column type CapillaryCapillaryCapillaryCapillaryCapillary
Active phase AT-5DB-5DB-1HP-5MSHP-5
Column length (m) 60.30.30.25.30.
Carrier gas HeHeHeHe
Substrate
Column diameter (mm) 0.250.250.250.250.25
Phase thickness (μm) 0.250.250.10.250.25
Program 50 0C 5 0C/min -> 135 0C (1 min) 5 0C/min -> 225 0C (5 min) 5 0C/min -> 260 0C60C => 3C/min => 210C => 5C/min => 250C(2min)35C => 4C/min => 180C => 10C/min => 250C40C(2min) => 8C/min => 160C => 15C/min => 250C(3min)not specified
I 991.988.0978.989.989.
ReferenceUsai, Atzei, et al., 2003Veres, Varga, et al., 2003Bezerra, Andrade-Neto, et al., 2002Demyttenaere, Moriña, et al., 2002Jordán, Goodner, et al., 2002
Comment MSDC-RI MSDC-RI MSDC-RI MSDC-RI MSDC-RI
Column type CapillaryCapillaryCapillaryCapillaryCapillary
Active phase HP-5SE-54SE-30SE-30CP Sil 8 CB
Column length (m) 30. 60.60.50.
Carrier gas   HeHeHe
Substrate
Column diameter (mm) 0.25 0.250.250.32
Phase thickness (μm) 0.25
Program not specifiednot specified50 0C (5 min) 5 0C/min -> 165 0C 4 0C/min -> 230 0Cnot specified60C(2min) => 5C/min => 160C(1min) => 10C/min => 250C (2min)
I 982.989.983.981.991.
ReferenceJordán, Goodner, et al., 2002Kilic, 2002Li, Wu, et al., 2002Li, Wu, et al., 2002Mockute and Judzentiene, 2002
Comment MSDC-RI MSDC-RI MSDC-RI MSDC-RI MSDC-RI
Column type CapillaryCapillaryCapillaryCapillaryCapillary
Active phase CP Sil 8 CBHP-1DB-5DB-5MSHP-5MS
Column length (m) 50.30.30.30.30.
Carrier gas HeHeHeHe
Substrate
Column diameter (mm) 0.320.320.250.320.32
Phase thickness (μm)  0.250.10.250.24
Program 60C(2min) => 5C/min => 160C(1min) => 10C/min => 250C(2min)40C(3min) => 5C/min => 180C => 15C/min => 240C(15min)35C => 4C/min => 180C => 10C/min => 250Cnot specifiednot specified
I 991.998.992.988.1005.
ReferenceMockute and Judzentiene, 2002, 2Nogueira and Romano, 2002Pessoa, Morais, et al., 2002Phutdhawong, Korth, et al., 2002Stashenko, Jaramillo, et al., 2002
Comment MSDC-RI MSDC-RI MSDC-RI MSDC-RI MSDC-RI
Column type CapillaryCapillaryCapillaryCapillaryCapillary
Active phase DB-5DB-5HP-5MSHP-5CP Sil 8 CB
Column length (m) 30.30.30.30.60.
Carrier gas HeHeHe
Substrate
Column diameter (mm) 0.250.250.250.250.25
Phase thickness (μm) 0.10.250.250.250.25
Program 35C => 4C/min => 180C => 20C/min => 280C35C => 4C/min => 180C => 20C/min => 280C40C (10min) => 3C/min => 120C => 10C/min => 250C (5min)not specifiednot specified
I 991.981.992.983.992.
ReferenceViana, Andrade-Neto, et al., 2002Viana, Andrade-Neto, et al., 2002, 2Ansorena, Gimeno, et al., 2001Aparicio, Romero, et al., 2001Duckham, Dodson, et al., 2001
Comment MSDC-RI MSDC-RI MSDC-RI MSDC-RI MSDC-RI
Column type CapillaryCapillaryCapillaryCapillaryCapillary
Active phase DB-5DB-1CP Sil 5 CBCBP-1DB-5
Column length (m)  30.50.25.
Carrier gas    Nitrogen
Substrate
Column diameter (mm)  0.250.320.25
Phase thickness (μm)  0.251.20.25
Program not specified45 0C 3 K/min -> 175 0C 15 K/min -> 300 0C (10 min)36C => 20C/min => 120C(20min) => 2C/min => 250C(30min)not specifiednot specified
I 978.975.982.981.990.
ReferenceFerreira, Costantin, et al., 2001Figueiredo, Miguel, et al., 2001Lermusieau, Bulens, et al., 2001Ly, Yamauchi, et al., 2001Petrakis, Tsitsimpikou, et al., 2001
Comment MSDC-RI MSDC-RI MSDC-RI MSDC-RI MSDC-RI
Column type CapillaryCapillaryCapillaryCapillaryCapillary
Active phase SE-54HP-5 MSHP-5OV-101DB-5
Column length (m)  30.30.50.30.
Carrier gas  HeliumHeN2He
Substrate
Column diameter (mm)  0.250.250.250.25
Phase thickness (μm)  0.250.25 0.25
Program 35C (2min) => 40C/min => 50C (2min) => 6C/min => 180C => 10C/min => 240Cnot specified50 0C 3 K/min -> 200 0C 8 K/min -> 280 0Cnot specified40C => 2C/min => 60C => 4C/min => 260C
I 988.986.981.981.993.
ReferenceSchieberle and Steinhaus, 2001Shang, Hu, et al., 2001Usubillaga, Aparicio, et al., 2001Yang, 2001Andrade, Maia, et al., 2000
Comment MSDC-RI MSDC-RI MSDC-RI MSDC-RI MSDC-RI
Column type CapillaryCapillaryCapillaryCapillaryCapillary
Active phase HP-1DB-1CBP-1BP-1DB-1
Column length (m) 12.30. 50.30.
Carrier gas HeH2  H2
Substrate
Column diameter (mm) 0.200.25 0.220.25
Phase thickness (μm) 0.330.25 0.250.25
Program 40 0C 6.7 0C/min -> 87 0C (9 min) 10 0C/min -> 187 0C40 0C 3 K/min -> 175 0C 15 K/min -> 240 0C (10 min)not specifiednot specified40 0C 3 K/min -> 175 0C 15 K/min -> 240 0C (10 min)
I 981.975.991.983.975.
ReferenceBetts, 2000Dorman, Figueiredo, et al., 2000Juliani, Biurrun, et al., 2000Muselli, Bighelli, et al., 2000da Silva, Pedro, et al., 2000
Comment MSDC-RI MSDC-RI MSDC-RI MSDC-RI MSDC-RI
Column type CapillaryCapillaryCapillaryCapillaryCapillary
Active phase AT-5DB-1SE-30DB-1CP Sil 5 CB
Column length (m) 60.30.30.30.25.
Carrier gas  HeHeliumHe
Substrate
Column diameter (mm) 0.250.250.250.250.39
Phase thickness (μm) 0.250.250.200.25
Program 60C(1min) => 4C/min => 200C=10C/min => 280C(20min)45C => 3C/min => 170C => 15C/min => 300C(10min)not specified45C => 3C/min => 175C => 15C/min => 300C(10min)not specified
I 991.9975.984.975.983.
ReferenceVelásquez, Toro, et al., 2000Pedro, da Silva, et al., 1999Prikhod'ko, Klyuev, et al., 1999Santos, Figueiredo, et al., 1999Weyerstahl, Marschall, et al., 1999
Comment MSDC-RI MSDC-RI MSDC-RI MSDC-RI MSDC-RI
Column type CapillaryCapillaryCapillaryCapillaryCapillary
Active phase DB-1OV-1RTX-5DB-5DB-1
Column length (m) 30.50.30.30.30.
Carrier gas HeHeHeN2H2
Substrate
Column diameter (mm) 0.250.320.530.250.25
Phase thickness (μm) 0.250.251.50.250.25
Program 45C => 3C/min => 175C => 15C/min => 240C (10min)1)50C(1min) => 4C/min => 180C => 2C/min => 250C(10min) 2)50C(1min) => 6C/min => 200C => 12C/min => 250C(5min)35 0C (2 min) 40 0C/min -> 60 0C (1 min) 6 0C/min -> 230 0C45C(5min) => 2C/min => 200C => 5C/min => 250C45C => 3C/min => 175C => 15C => 240C(10min)
I 975.987.992.993.975.
ReferenceBaratta, Dorman, et al., 1998Kökdil, 1998Masanetz and Grosch, 1998Sanda, Koba, et al., 1998da Silva, Figueiredo, et al., 1998
Comment MSDC-RI MSDC-RI MSDC-RI MSDC-RI MSDC-RI
Column type CapillaryCapillaryCapillaryCapillaryCapillary
Active phase CP Sil 5 CBDB-5DB-5DB-1DB-1
Column length (m) 25.30.15.30.30.
Carrier gas N2HeHeH2He
Substrate
Column diameter (mm)  0.250.250.250.25
Phase thickness (μm) 0.390.250.250.250.25
Program not specified60C => 3C/min => 240C => 30C/min => 300C40C(5min) => 5C/min => 120C(10min) => 4C/min => 250C(4min) => 5C/min => 280C45C => 3C/min => 175C => 15C/min => 240C(10min)45C => 3C/min => 175C => 15C/min => 280C
I 985.988.990.975.975.
ReferenceWeyerstahl, Marschall, et al., 1998Yusuf, Begum, et al., 1998Anitescu, Doneanu, et al., 1997Figueiredo, Barroso, et al., 1997Gaspar, Palma, et al., 1997
Comment MSDC-RI MSDC-RI MSDC-RI MSDC-RI MSDC-RI
Column type CapillaryCapillaryCapillaryCapillaryCapillary
Active phase DB-5SPB-SulfurDB-5DB-1Methyl Silicone
Column length (m)  30.50.30.
Carrier gas  HeHeHelium
Substrate
Column diameter (mm)  0.320.320.25
Phase thickness (μm)  4.0.25
Program not specifiednot specified40C (10min) => 3C/min => 95C => 10C/min => 270C (10min)35 0C 4 0C/min -> 180 0C 10 0C/min -> 250 0Cnot specified
I 991.983.992.971.983.
ReferenceIsidorov, Zenkevich, et al., 1997Mariaca, Berger, et al., 1997Mateo and Zumalacárregui, 1996de Morais, Craveiro, et al., 1996Zenkevich, 1996
Comment MSDC-RI MSDC-RI MSDC-RI MSDC-RI MSDC-RI
Column type CapillaryCapillaryCapillaryCapillaryCapillary
Active phase 5 % Phenyl methyl siloxaneDB-1DB-1DB-5DB-5
Column length (m)  60.60.30.30.
Carrier gas
Substrate
Column diameter (mm)  0.320.320.320.32
Phase thickness (μm)  0.250.251.1.
Program not specifiednot specified3 min at 5 C; 5 - 50 C at 3 deg/min; 50 - 220 C at 5 deg/min0C(5min) => 60C/min => 60C (5min) => 4C/min => 250C (5min)0C(5min) => 60C/min => 60C (5min) => 4C/min => 250C (5min)
I 991.985.985.972.973.
ReferenceSagrero-Nieves and Bartley, 1995Ciccioli, Cecinato, et al., 1994Ciccioli, Brancaleoni, et al., 1993Storer, Elmore, et al., 1993Storer, Elmore, et al., 1993
Comment MSDC-RI MSDC-RI MSDC-RI MSDC-RI MSDC-RI
Column type CapillaryCapillaryCapillaryCapillaryCapillary
Active phase DB-5DB-1DB-1OV-101DB-1
Column length (m) 30.60.60.
Carrier gas   He
Substrate
Column diameter (mm) 0.320.320.32
Phase thickness (μm) 1. 0.25
Program 0C(5min) => 60C/min => 60C (5min) => 4C/min => 250C (5min)not specified-80 C (20 min; during thermal desorption) 50-200 C at 4 C/min 200-320 C at 10 C/minnot specifiednot specified
I 980.981.980.983.983.
ReferenceStorer, Elmore, et al., 1993Binder and Flath, 1989Miller, Bills, et al., 1989De Pooter, Vermeesch, et al., 1989MacLeod and Snyder, 1988
Comment MSDC-RI MSDC-RI MSDC-RI MSDC-RI MSDC-RI
Column type CapillaryCapillaryCapillaryCapillaryCapillary
Active phase methyl silicone oil with 5% Igepalmethyl silicone oil with 5% IgepalDB-1DB-1OV-1
Column length (m) 150.150.30.30.35.
Carrier gas   H2H2
Substrate
Column diameter (mm) 0.750.750.250.250.50
Phase thickness (μm)   0.250.251.5
Program not specifiednot specified30C (2min) => 2C/min => 150C => 4C/min => 250C30C (2min) => 2C/min => 150C => 4C/min => 250Cnot specified
I 982.984.980.981.983.
ReferenceSchultz, Flath, et al., 1988Schultz, Flath, et al., 1988Takeoka, Flath, et al., 1988Takeoka, Flath, et al., 1988De Pooter and Schamp, 1987
Comment MSDC-RI MSDC-RI MSDC-RI MSDC-RI MSDC-RI
Column type CapillaryCapillaryCapillaryCapillaryPacked
Active phase OV-101OV-101SF96+IgepalOV-1, SE-30, Methyl silicone, SP-2100, OV-101, DB-1, etc.OV-101
Column length (m) 60. 152.50.2.5
Carrier gas    HydrogenN2
Substrate     Chromosorb G 60-80mesh DMCS
Column diameter (mm) 0.25 0.760.32
Phase thickness (μm)
Program not specifiednot specified25C(1min) => 5C/min => 50C (4min) => 1.25C/min => 180Cnot specifiednot specified
I 986.986.988.984.983.
ReferenceShibamoto, 1987Shibamoto, 1987Flath, Altieri, et al., 1984Waggott and Davies, 1984Swigar and Silverstein, 1981
Comment MSDC-RI MSDC-RI MSDC-RI MSDC-RI MSDC-RI

Kovats' RI, polar column, custom temperature program

Data compiled by: NIST Mass Spectrometry Data Center, William E. Wallace, director

Column type CapillaryCapillary
Active phase HP-InnowaxCarbowax
Column length (m) 30.127.
Carrier gas H2
Substrate
Column diameter (mm) 0.320.75
Phase thickness (μm) 0.50
Program 60 0C (8 min) 3 K/min -> 180 0C 20 K/min -> 230 0C (20 min)not specified
I 1173.1172.
ReferenceFrizzo, Serafini, et al., 2001Okamoto, Ellison, et al., 1981
Comment MSDC-RI MSDC-RI

Van Den Dool and Kratz RI, polar column, custom temperature program

Data compiled by: NIST Mass Spectrometry Data Center, William E. Wallace, director

Column type CapillaryCapillaryCapillaryCapillaryCapillary
Active phase Supelcowax-10Supelcowax-10Supelcowax-10DB-WaxCP-Wax 52CB
Column length (m) 30.30.30. 50.
Carrier gas  HeHe He
Substrate
Column diameter (mm) 0.250.250.25 0.25
Phase thickness (μm) 0.250.250.25 0.2
Program 35C(8min) => 4C/min => 60C => 6C/min => 160C => 20C/min => 220C(1min)35C(8min) => 4C/min => 60C => 6C/min => 160C => 20C/min => 200C(1min)35C(8min) => 4C/min => 60C => 6C/min => 160C => 20C/min => 200C(1min)not specified33C(1.5min) => 1.5C/min => 60C(4min) => 2C/min => 100C => 8C/min => 220C(15min)
I 1169.1167.1169.1175.1151.
ReferenceBianchi, Cantoni, et al., 2007Bianchi, Careri, et al., 2007Bianchi, Careri, et al., 2007Elston, Lin, et al., 2005Kaack, Christensen, et al., 2005
Comment MSDC-RI MSDC-RI MSDC-RI MSDC-RI MSDC-RI
Column type CapillaryCapillaryCapillaryCapillaryCapillary
Active phase Carbowax 20MStabilwaxStabilwaxDB-WaxDB-Wax
Column length (m) 25.30.30.30.30.
Carrier gas H2HeHeHeHe
Substrate
Column diameter (mm) 0.320.320.320.250.25
Phase thickness (μm) 0.251.1.0.250.25
Program 40C(8min) => 3C/min => 180C => 20C/min => 230C(10min)40C(2min) => 5C/min => 100C => 4C/min => 230C (10min)40C(2min) => 5C/min => 100C => 4C/min => 230C (10min)40 (5min) => 4C/min => 140C => 4C/min => 200C (20min)40 (5min) => 4C/min => 140C => 4C/min => 200C (20min)
I 1121.1181.1168.1153.1150.
ReferenceLorenzo, Paz, et al., 2005Wang, Finn, et al., 2005Wang, Finn, et al., 2005Zheng, Kim, et al., 2005Zheng, Kim, et al., 2005
Comment MSDC-RI MSDC-RI MSDC-RI MSDC-RI MSDC-RI
Column type CapillaryCapillaryCapillaryCapillaryCapillary
Active phase DB-WaxRTX-WaxCarbowax 20MDB-WaxBP-20
Column length (m) 30. 25.30.25.
Carrier gas Helium H2HeHe
Substrate
Column diameter (mm) 0.32 0.320.250.25
Phase thickness (μm) 0.50 0.250.50.25
Program not specifiednot specified40C(8min) => 3C/min => 180C => 20C/min => 230C40C(2min) => 2C/min => 100C => 10C/min => 230C (5min)40C(8min) => 3C/min => 180C => 20C/min => 230C
I 1168.1152.1167.1169.1145.
ReferenceBell, 2004Dugo, Mondello, et al., 2004Frizzo, Lorenzo, et al., 2004Klesk and Qian, 2003Lorenzo, Loayza, et al., 2003
Comment MSDC-RI MSDC-RI MSDC-RI MSDC-RI MSDC-RI
Column type CapillaryCapillaryCapillaryCapillaryCapillary
Active phase StabilwaxBP-20Carbowax 20MCarbowax 20MRTX-Wax
Column length (m)  25.25.25.60.
Carrier gas HeHeH2H2
Substrate
Column diameter (mm)  0.250.320.320.25
Phase thickness (μm)  0.250.250.250.25
Program 50C(8min) => 4C/min => 180C(10min) => 5C/min => 220C40 0C (8 min) 3 K/min -> 180 0C 20 K/min -> 230 0C40C(8min) => 3C/min => 180C => 20C/min => 230C40C(8min) => 3C/min => 180C => 20C/min => 230Cnot specified
I 1156.1119.1124.1120.1160.
ReferenceHudaib, Speroni, et al., 2002Lorenzo, Loayza, et al., 2002Lorenzo, Paz, et al., 2002Lorenzo, Paz, et al., 2002Cavalli, Ranarivelo, et al., 2001
Comment MSDC-RI MSDC-RI MSDC-RI MSDC-RI MSDC-RI
Column type CapillaryCapillaryCapillaryCapillaryCapillary
Active phase Carbowax 20MCarbowax 20MDB-WaxBP-20Carbowax 20M
Column length (m) 25.25.30.
Carrier gas H2H2H2
Substrate
Column diameter (mm) 0.320.320.25
Phase thickness (μm) 0.250.250.25
Program 40 0C (8 min) 3 K/min -> 180 0C 20 K/min -> 230 0C40 0C (8 min) 3 K/min -> 180 0C 20 K/min -> 230 0C60 0C (3 min) 2 K/min -> 220 0C 5 K/min -> 250 0C (15 min)not specifiednot specified
I 1113.1164.1154.1157.1120.
ReferenceLorenzo, Paz, et al., 2001Lorenzo, Saavedra, et al., 2001Boulanger and Crouzet, 2000Filippini, Tomi, et al., 2000Lorenzo, Dellacassa, et al., 2000
Comment MSDC-RI MSDC-RI MSDC-RI MSDC-RI MSDC-RI
Column type CapillaryCapillaryCapillaryCapillaryCapillary
Active phase FFAPFFAPFFAPCarbowax 20MFFAP
Column length (m) 25.30.30.25.30.
Carrier gas HeHeHeH2He
Substrate
Column diameter (mm) 0.320.320.320.320.32
Phase thickness (μm)  0.250.250.250.25
Program 35C (2min) => 40C/min => 60C (2min) => 6C/min => 180C => 10C/min => 240C35C (2min) => 40C/min => 60C (2min) => 6C/min => 180C => 10C/min => 230C (10min)40C(1min) => 40C/min => 60C => 6C/min => 230C40 0C (8 min) 3 K/min -> 180 0C 20 K/min -> 230 0C35C (2min) => 40C/min => 60C (2min) => 6C/min => 180C => 10C/min => 230C (5min)
I 1154.1154.1163.1138.1158.
ReferenceSteinhaus and Schieberle, 2000Buettner and Schieberle, 1999Jagella and Grosch, 1999Loayza, de Groot, et al., 1999Tairu, Hofmann, et al., 1999
Comment MSDC-RI MSDC-RI MSDC-RI MSDC-RI MSDC-RI
Column type CapillaryCapillaryCapillaryCapillaryCapillary
Active phase HP-InnowaxHP-InnowaxSupelcowax-10Supelcowax-10Carbowax 20M
Column length (m) 30.60.60.30.150.
Carrier gas HeHeHeHe
Substrate
Column diameter (mm) 0.250.250.250.320.75
Phase thickness (μm) 0.250.250.25
Program 60C(8min) => 3C/min => 180C(5min) => 40C/min => 250C32C(1.5min) => 3C/min => 40C (10min) => 3C/min => 200C (10min)40C => (6C/min) => 80C(6min) => (15C/min) => 200C(10min)35C => 60C/min => 50C (5min) => 4C/min => 220Cnot specified
I 1160.1169.1155.1145.1150.
ReferenceBisio, Ciarallo, et al., 1998Iversen, Jakobsen, et al., 1998Cadwallader and Xu, 1994Schieberle and Grosch, 1988Whitfield, Shea, et al., 1981
Comment MSDC-RI MSDC-RI MSDC-RI MSDC-RI MSDC-RI

Kovats' RI, non-polar column, custom temperature program

Data compiled by: NIST Mass Spectrometry Data Center, William E. Wallace, director

Column type CapillaryCapillaryCapillaryCapillaryCapillary
Active phase HP-5DB-5DB-5MSBP-1DB-5
Column length (m)  30.30.25.30.
Carrier gas HeHeHeN2He
Substrate
Column diameter (mm)  0.250.250.250.25
Phase thickness (μm)  0.10.250.250.25
Program 60C(5min) => 3C/min => 100C => 1C/min => 160C => 10C/min => 240C(10min)35C => 4C/min => 180C => 20C/min => 280C60C(5min) => 2C/min => 140C= 5C/min => 250C(5min)60C => 5C/min => 220C(5min) => 3C/min => 245C(5min)35C => 4C/min => 180C => 20C/min => 280C
I 990.978.990.981.991.
Referencede Marchese, de Heluani, et al., 2007Lima, Barros, et al., 2005Tuberoso, Kowalczyk, et al., 2005Dwivedi, Khan, et al., 2004Araújo, Silveira, et al., 2003
Comment MSDC-RI MSDC-RI MSDC-RI MSDC-RI MSDC-RI
Column type CapillaryCapillaryCapillaryCapillaryCapillary
Active phase HP-5BP-1BP-1BP-1HP-5
Column length (m) 30.25.25.30.30.
Carrier gas HeN2N2N2He
Substrate
Column diameter (mm) 0.250.250.320.320.25
Phase thickness (μm) 0.250.250.250.250.25
Program 40C (3min) => 3C/min => 180C => 30C/min => 270C (5min)60C => 5C/min => 220C (5min) => 3C/min => 245 C (5min)60C => 5C/min => 220C(5min) => 3C/min => 245C(5min)60C => 5.5C/min => 220C => 3.5C/min => 245Cnot specified
I 991.984.988.980.991.
ReferenceDaferera, Ziogas, et al., 2003Khan, Srivastava, et al., 2003Raina, Srivastava, et al., 2003Rao, Kaul, et al., 2003Shellie and Marriott, 2003
Comment MSDC-RI MSDC-RI MSDC-RI MSDC-RI MSDC-RI
Column type CapillaryCapillaryCapillaryCapillaryCapillary
Active phase HP-1OV-1BP-1DB-5HP-5
Column length (m) 30.15.30. 30.
Carrier gas HeHeN2 H2
Substrate
Column diameter (mm) 0.250.3170.32 0.32
Phase thickness (μm) 0.250.250.25 0.25
Program 35C => 2C/min => 100C => 5C/min => 230C(2min)50C(4min) => (4C/min) => 90C => (10C/min)=300C(10min)60 C 5 C/min -> 220 C (5 min) 3 C/min -> 245 C (5 min)not specified60 0C (8 min) 3 K/min -> 180 0C 20 K/min (20 min)
I 992.981.984.991.990.
ReferenceWongpornchai, Sriseadka, et al., 2003El-Shazly, Dorai, et al., 2002Khan, Srivastava, et al., 2002Bizzo, Lopes, et al., 2001Frizzo, Serafini, et al., 2001
Comment MSDC-RI MSDC-RI MSDC-RI MSDC-RI MSDC-RI
Column type CapillaryCapillaryCapillaryCapillaryCapillary
Active phase DB-5HP-5DB-5AT-5DB-5
Column length (m) 30.30. 60.30.
Carrier gas H2He HeHe
Substrate
Column diameter (mm) 0.200.25 0.250.25
Phase thickness (μm)  0.25 0.25
Program not specified50 0C 5 K/min -> 140 0C 2 K/min -> 170 0Cnot specified60 C 4K/min -> 200 C 10 K/min -> 280 Cnot specified
I 991.993.992.988.986.
ReferenceMoreira, Sousa, et al., 2001Novak, Zitterl-Eglseer, et al., 2001Dickens J.C., 2000Khouri, Usubillaga, et al., 2000Rao, Rout, et al., 2000
Comment MSDC-RI MSDC-RI MSDC-RI MSDC-RI MSDC-RI
Column type CapillaryCapillaryCapillaryCapillaryCapillary
Active phase AT-5DB-5DB-5DB-5Methyl Silicone
Column length (m) 60.30.30.30.25.
Carrier gas He HeHe
Substrate
Column diameter (mm) 0.250.260.250.25
Phase thickness (μm) 0.250.250.250.25
Program 60 C (1 min) 4 K/min -> 200 C 10 K/min -> 280 Cnot specified40C => 2C/min => 60C => 4C/min => 260C40C => 2C/min => 60C => 4C/min => 240C50 0C 4 0C/min -> 180 0C 10 0C/min -> 250 0C
I 991.991.983.988.976.
ReferenceRojas and Usubillaga, 2000Adams, 1998Andrade, Santos, et al., 1998Santos, Andrade, et al., 1998Machado, Militao, et al., 1995
Comment MSDC-RI MSDC-RI MSDC-RI MSDC-RI MSDC-RI
Column type CapillaryCapillaryCapillaryPacked
Active phase BP-1SF-96SF-96SE-30
Column length (m) 25.127.150.6.1
Carrier gas    He
Substrate    Chromasorb W
Column diameter (mm) 0.20.750.75
Phase thickness (μm)
Program not specifiednot specifiednot specified150C (10min) => 15C/min => 200C(16min) => 10C/min => 240C
I 986.977.984.987.
ReferenceMacLeod, MacLeod, et al., 1988Okamoto, Ellison, et al., 1981Malingré and Maarse, 1974Minyard, Tumlinson, et al., 1967
Comment MSDC-RI MSDC-RI MSDC-RI MSDC-RI

Kovats' RI, polar column, temperature ramp

Data compiled by: NIST Mass Spectrometry Data Center, William E. Wallace, director

Column type CapillaryCapillaryCapillaryCapillaryCapillary
Active phase StabilwaxHP-WaxDB-WaxInnowaxInnowax
Column length (m) 30.50.30.30.50.
Carrier gas N2HeHeHeHe
Substrate
Column diameter (mm) 0.320.20.320.250.25
Phase thickness (μm) 1.0.40.250.250.25
Tstart (C) 50.60.40.50.50.
Tend (C) 220.230.220.250.180.
Heat rate (K/min) 2.4.3.0.52.5
Initial hold (min) 3. 5.5.5.
Final hold (min) 15.30. 10.
I 1173.1164.1164.1145.1166.
ReferenceHazzit, Baaliouamer, et al., 2006Gauvin, Lecomte, et al., 2004Lopes, Strobl, et al., 2004Viña and Murillo, 2003Yáñez, Pinzón, et al., 2002
Comment MSDC-RI MSDC-RI MSDC-RI MSDC-RI MSDC-RI
Column type CapillaryCapillaryCapillaryCapillaryCapillary
Active phase Carbowax 20MCarbowax 20MCarbowax 20MCarbowax 20MSupelcowax-10
Column length (m) 50.50.25.25.30.
Carrier gas   N2N2
Substrate
Column diameter (mm) 0.320.320.250.5
Phase thickness (μm) 0.20.2
Tstart (C) 60.60.60.60.40.
Tend (C) 260.260.200.200.210.
Heat rate (K/min) 2.2.5.5.2.
Initial hold (min)     2.
Final hold (min)     120.
I 1156.1162.1155.1162.1162.
ReferenceVera and Chane-Ming, 1999Vera and Chane-Ming, 1999Kulkarni, Mallavarapu, et al., 1998Mallavarapu, Rao, et al., 1998Loayza, Abujder, et al., 1995
Comment MSDC-RI MSDC-RI MSDC-RI MSDC-RI MSDC-RI
Column type CapillaryCapillaryCapillaryCapillaryCapillary
Active phase Supelcowax-10DB-WaxSupelcowax-10DB-WaxDB-Wax
Column length (m) 30.60.60.60.60.
Carrier gas  HeHeHeHe
Substrate
Column diameter (mm)  0.250.250.250.25
Phase thickness (μm)    0.250.25
Tstart (C) 40.40.35.40.40.
Tend (C) 210.200.200.200.200.
Heat rate (K/min) 2.2.3.3.3.
Initial hold (min) 2.2.5.5.5.
Final hold (min) 120. 20.
I 1163.1160.1156.1165.1167.
ReferenceLoayza, Abujder, et al., 1995Umano, Hagi, et al., 1994Wong and Tie, 1993Tatsuka, Suekane, et al., 1990Tatsuka, Suekane, et al., 1990
Comment MSDC-RI MSDC-RI MSDC-RI MSDC-RI MSDC-RI
Column type CapillaryCapillaryCapillaryCapillaryCapillary
Active phase DB-WaxDB-WaxCarbowax 20MBP-20Carbowax 20M
Column length (m) 60.60.50.25.50.
Carrier gas   He H2
Substrate
Column diameter (mm) 0.250.250.30.3320.3
Phase thickness (μm)     0.15
Tstart (C) 40.40.70.70.70.
Tend (C) 220.220.210.200.210.
Heat rate (K/min) 2.2.2.4.2.
Initial hold (min) 10.10. 2.
Final hold (min)
I 1165.1162.1176.1169.1169.
ReferenceUmano and Shibamoto, 1988Umano and Shibamoto, 1988Randriamiharisoa and Gaydou, 1987Wyllie, Cook, et al., 1987Gaydou, Randriamiharisoa, et al., 1986
Comment MSDC-RI MSDC-RI MSDC-RI MSDC-RI MSDC-RI
Column type CapillaryCapillaryCapillaryCapillaryCapillary
Active phase Carbowax 20MCarbowax 20MCarbowax 20MCarbowax 20MCarbowax 20M
Column length (m) 100.100.150.150.50.
Carrier gas   He
Substrate
Column diameter (mm) 0.280.280.640.640.28
Phase thickness (μm)
Tstart (C) 80.80.50.50.80.
Tend (C) 200.200.170.170.200.
Heat rate (K/min) 3.3.1.1.2.
Initial hold (min)   30.30.
Final hold (min)
I 1149.1150.1160.1160.1150.
ReferenceBernhard, Shibamoto, et al., 1983Bernhard, Shibamoto, et al., 1983Buttery, Kamm, et al., 1982Buttery, Ling, et al., 1982Toda, Yamaguchi, et al., 1982
Comment MSDC-RI MSDC-RI MSDC-RI MSDC-RI MSDC-RI
Column type CapillaryCapillaryCapillaryCapillary
Active phase Carbowax 20MCarbowax 20MCarbowax 20MCarbowax 20M
Column length (m) 50.50.50.50.
Carrier gas  N2N2He
Substrate
Column diameter (mm) 0.280.280.280.28
Phase thickness (μm)
Tstart (C) 80.80.80.70.
Tend (C) 200.200.200.190.
Heat rate (K/min) 2.2.2.2.
Initial hold (min)
Final hold (min)
I 1151.1137.1140.1166.
ReferenceToda, Yamaguchi, et al., 1982Yamaguchi and Shibamoto, 1979Yamaguchi and Shibamoto, 1979Tressl, Friese, et al., 1978
Comment MSDC-RI MSDC-RI MSDC-RI MSDC-RI

References

Weast and Grasselli, 1989
CRC Handbook of Data on Organic Compounds, 2nd Editon, Weast,R.C and Grasselli, J.G., ed(s)., CRC Press, Inc., Boca Raton, FL, 1989, 1. [all data]
Semmler, 1901
Semmler, F.W.,
Chem. Ber., 1901, 34, 3126. [all data]
van Roon, Parsons, et al., 2002
van Roon, André; Parsons, John R.; Govers, Harrie A.J.,
Gas chromatographic determination of vapour pressure and related thermodynamic properties of monoterpenes and biogenically related compounds,
Journal of Chromatography A, 2002, 955, 1, 105-115, https://doi.org/10.1016/S0021-9673(02)00200-5
. [all data]
Stephenson and Malanowski, 1987
Stephenson, Richard M.; Malanowski, Stanislaw,
Handbook of the Thermodynamics of Organic Compounds, 1987, https://doi.org/10.1007/978-94-009-3173-2
. [all data]
Stull, 1947
Stull, Daniel R.,
Vapor Pressure of Pure Substances. Organic and Inorganic Compounds,
Ind. Eng. Chem., 1947, 39, 4, 517-540, https://doi.org/10.1021/ie50448a022
. [all data]
Bukala, Majewski, et al., 1954
Bukala, M.; Majewski, J.; Rodzinski, W.,
Przem. Chem., 1954, 10, 6. [all data]