3-Allyloxy-1,2 propanediol
- Formula: C6H12O3
- Molecular weight: 132.1577
- IUPAC Standard InChIKey: PAKCOSURAUIXFG-UHFFFAOYSA-N
- CAS Registry Number: 123-34-2
- Chemical structure:
View 3d structure (requires JavaScript / HTML 5) - Other names: Glycerol-1-allyl ether; Allyl-α-glyceryl ether; Glycerol-α-allyl ether; Glycerol α-monoallyl ether; 1,2-Propanediol, 3-(2-propenyloxy)-; Ether, allyl glyceryl; 1-Allyloxy-2,3-propanediol; 1,2-Propanediol, 3-(allyloxy)-; 3-(Allyloxy)propanediol; 3-(2-Propenyloxy)-1,2-propanediol; α-Allyl glycerol ether; Glycerol 1-monoallyl ether; Glycerin 1-allyl ether; 1,2-Propanediol, 3-(2-propen-1-yloxy)-; NSC 59722; 3-(allyloxy)propane-1,2-diol

Phase change data

Data compiled as indicated in comments:
BS - Robert L. Brown and Stephen E. Stein
AC - William E. Acree, Jr., James S. Chickos
Reduced pressure boiling point
Tboil (K) | Pressure (bar) | Reference | Comment |
---|---|---|---|
415.2 | 0.037 | Aldrich Chemical Company Inc., 1990 | BS |
Enthalpy of vaporization
ΔvapH (kJ/mol) | Temperature (K) | Method | Reference | Comment |
---|---|---|---|---|
74.7 | 338. | A | Stephenson and Malanowski, 1987 | Based on data from 323. to 383. K. See also Dykyj, 1972.; AC |

References

Aldrich Chemical Company Inc., 1990
Aldrich Chemical Company Inc.,
Catalog Handbook of Fine Chemicals, Aldrich Chemical Company, Inc., Milwaukee WI, 1990, 1. [all data]
Stephenson and Malanowski, 1987
Stephenson, Richard M.; Malanowski, Stanislaw,
Handbook of the Thermodynamics of Organic Compounds, 1987, https://doi.org/10.1007/978-94-009-3173-2
. [all data]
Dykyj, 1972
Dykyj, J.,
Petrochemia, 1972, 12, 1, 13. [all data]