Pyrazine, 2,5-dimethyl-
- Formula: C6H8N2
- Molecular weight: 108.1411
- IUPAC Standard InChIKey: LCZUOKDVTBMCMX-UHFFFAOYSA-N
- CAS Registry Number: 123-32-0
- Chemical structure:
View 3d structure (requires JavaScript / HTML 5) - Other names: 2,5-Dimethylpyrazine

Phase change data

Data compiled as indicated in comments:
BS - Robert L. Brown and Stephen E. Stein
TRC - Thermodynamics Research Center, NIST Boulder Laboratories, Chris Muzny director
AC - William E. Acree, Jr., James S. Chickos
Quantity | Value | Units | Method | Reference | Comment |
---|---|---|---|---|---|
Tboil | 428.2 | K | N/A | Weast and Grasselli, 1989 | BS |
Tboil | 428.15 | K | N/A | Anderson and Shimanskaya, 1969 | Uncertainty assigned by TRC = 2. K; TRC |
Tboil | 427.25 | K | N/A | Bruhl, 1895 | Uncertainty assigned by TRC = 1.5 K; TRC |
Quantity | Value | Units | Method | Reference | Comment |
Tfus | 257.65 | K | N/A | Lanum and Morris, 1969 | Uncertainty assigned by TRC = 0.2 K; TRC |
Quantity | Value | Units | Method | Reference | Comment |
ΔvapH° | 47.2 ± 2.2 | kJ/mol | CGC | Lipkind and Chickos, 2009 | Based on data from 342. to 373. K.; AC |
Enthalpy of vaporization
ΔvapH (kJ/mol) | Temperature (K) | Reference | Comment |
---|---|---|---|
44.5 | 357. | Sakoguchi, Ueoka, et al., 1995 | Based on data from 303. to 411. K.; AC |

Van Den Dool and Kratz RI, polar column, custom temperature program

Data compiled by: NIST Mass Spectrometry Data Center, William E. Wallace, director

Column type CapillaryCapillaryCapillaryCapillaryCapillary
Active phase Supelcowax-10Supelcowax-10Supelcowax-10FFAPFFAP
Column length (m) 30.30.30.60.60.
Carrier gas HeHeHeHeHe
Substrate
Column diameter (mm) 0.250.250.250.250.25
Phase thickness (μm) 0.250.250.250.50.5
Program 35C(8min) => 4C/min => 60C => 6C/min => 160C => 20C/min => 200C(1min)40C(1min) => 10C/min => 120C => 15C/min => 200C (1min)35C(8min) => 4C/min => 60C => 6C/min => 160C => 20C/min => 200C(1min)50C(3min) => 3C/min => 100C => 10C/min => 220C(13.5min)50C(3min) => 3C/min => 100C => 10C/min => 220C (13.5min)
I 1318.1323.1321.1358.1358.
ReferenceBianchi, Careri, et al., 2007Bianchi, Careri, et al., 2007Bianchi, Careri, et al., 2007Ranau, Kleeberg, et al., 2005Ranau and Steinhart, 2005
Comment MSDC-RI MSDC-RI MSDC-RI MSDC-RI MSDC-RI
Column type CapillaryCapillaryCapillaryCapillaryCapillary
Active phase CP-Wax 52CBDB-WaxSupelcowax-10DB-WaxBP-20
Column length (m) 60.30.60.30.50.
Carrier gas He  HeHe
Substrate
Column diameter (mm) 0.250.250.250.320.32
Phase thickness (μm) 0.250.250.250.250.5
Program 40C => 5C/min => 60C => 2.5C/min => 155C20C(30s) => fast => 60C => 4C/min => 220C (20min)40C => (6C/min) => 80C(6min) => (15C/min) => 200C(10min)35C(2min) => 6C/min => 150C => 30C/min => 240C(1min)5 0C (0.5 min) -> (1 min) 60 0C (5 min) 4 0C/min -> 200 0C
I 1317.1314.1316.1319.1306.
ReferenceAlasalvar, Shahidi, et al., 2003Cantergiani, Brevard, et al., 2001Baek and Cadwallader, 1996Amrani-Hemaimi, Cerny, et al., 1995Beal and Mottram, 1994
Comment MSDC-RI MSDC-RI MSDC-RI MSDC-RI MSDC-RI

Kovats' RI, non-polar column, isothermal

Data compiled by: NIST Mass Spectrometry Data Center, William E. Wallace, director

Column type CapillaryCapillaryCapillaryCapillaryPacked
Active phase SE-30SE-30OV-101OV-101DC-200
Column length (m) 25.25.50.50.4.
Carrier gas HeHeHeHe
Substrate     Celite
Column diameter (mm) 0.320.320.250.25
Phase thickness (μm) 1.1.
Temperature (C) 110.80.110.80.120.
I 930.926.930.926.890.
ReferenceSamusenko and Golovnya, 1988Samusenko and Golovnya, 1988Golovnya, Samusenko, et al., 1987Golovnya, Samusenko, et al., 1987Reymond, Mueggler-Chavan, et al., 1966
Comment MSDC-RI MSDC-RI MSDC-RI MSDC-RI MSDC-RI

Normal alkane RI, polar column, temperature ramp

Data compiled by: NIST Mass Spectrometry Data Center, William E. Wallace, director

Column type CapillaryCapillaryCapillaryCapillaryCapillary
Active phase HP-FFAPHP-InnowaxFFAPDB-WaxCP-Wax
Column length (m) 25.15.30.60.60.
Carrier gas HeliumHeliumNitrogenHeliumHelium
Substrate
Column diameter (mm) 0.320.320.320.250.25
Phase thickness (μm) 0.500.500.500.500.25
Tstart (C) 45.40.35.40.50.
Tend (C) 220.250.250.210.230.
Heat rate (K/min) 15.3.4.2.6.
Initial hold (min)   5.5.2.
Final hold (min)   45.70.15.
I 1339.1319.1330.1348.1337.
ReferenceWanakhachornkrai and Lertsiri, 9999Puvipirom and Chaisei, 2012Budryn, Nebesny, et al., 2011Moon and Shibamoto, 2010Mo, Fan, et al., 2009
Comment MSDC-RI MSDC-RI MSDC-RI MSDC-RI MSDC-RI
Column type CapillaryCapillaryCapillaryCapillaryCapillary
Active phase DB-WaxHP-InnowaxZB-WaxDB-WaxStabilwax
Column length (m) 60.50.60.30.60.
Carrier gas HeliumHeliumHeliumHeHelium
Substrate
Column diameter (mm) 0.250.200.320.250.25
Phase thickness (μm) 0.500.330.500.250.25
Tstart (C) 40.50.40.50.40.
Tend (C) 210.250.220.230.240.
Heat rate (K/min) 2.10.4.4.3.
Initial hold (min) 5. 5. 5.
Final hold (min) 70.6.5.15.10.
I 1346.1308.1357.1321.1303.
ReferenceMoon and Shibamoto, 2009Du, Clery, et al., 2008Marin, Pozrl, et al., 2008Characterization of Pyrazines in Some Chinese Liquors and Their Approximate Concentrations, 2007Cros, Vandanjon, et al., 2007
Comment MSDC-RI MSDC-RI MSDC-RI MSDC-RI MSDC-RI
Column type CapillaryCapillaryCapillaryCapillaryCapillary
Active phase FFAPDB-WaxDB-WaxTC-WaxZB-Wax
Column length (m) 30.60.30.60.30.
Carrier gas N2HeHeN2Helium
Substrate
Column diameter (mm) 0.320.250.250.250.32
Phase thickness (μm) 0.50.25 0.250.25
Tstart (C) 35.50.60.70.40.
Tend (C) 320.200.180.220.250.
Heat rate (K/min) 4.2.2.3.5.
Initial hold (min) 5. 5. 2.
Final hold (min) 45.90.30.40.5.
I 1330.1302.1326.1338.1310.
ReferenceNebesny, Budryn, et al., 2007Fujioka and Shibamoto, 2006Osada and Shibamoto, 2006Ishizaki, Tachihara, et al., 2005N/A
Comment MSDC-RI MSDC-RI MSDC-RI MSDC-RI MSDC-RI
Column type CapillaryCapillaryCapillaryCapillaryCapillary
Active phase TC-WaxDB-WaxStabilwaxDB-WaxDB-Wax
Column length (m) 60.30.60.30.30.
Carrier gas HeHeHelium
Substrate
Column diameter (mm) 0.250.250.250.250.25
Phase thickness (μm) 0.50.250.250.250.25
Tstart (C) 40.50.40.30.30.
Tend (C) 230.180.240.250.250.
Heat rate (K/min) 3.3.3.4.4.
Initial hold (min) 8. 5.1.1.
Final hold (min)  40.10.
I 1332.1333.1303.1318.1321.
ReferenceIshikawa, Ito, et al., 2004Yanagimoto, Ochi, et al., 2004Cros, Vandanjon, et al., 2003Tanaka, Yamauchi, et al., 2003Tanaka, Yamauchi, et al., 2003
Comment MSDC-RI MSDC-RI MSDC-RI MSDC-RI MSDC-RI
Column type CapillaryCapillaryCapillaryCapillaryCapillary
Active phase HP-FFAPDB-WaxHP-FFAPHP-WaxDB-Wax
Column length (m) 25.60.25.60.60.
Carrier gas He  He
Substrate
Column diameter (mm) 0.320.250.320.250.32
Phase thickness (μm) 0.5 0.520.50.25
Tstart (C) 45.60.60.40.50.
Tend (C) 220.180.240.190.210.
Heat rate (K/min) 15.3.5.3.1.5
Initial hold (min)  4.1.6.5.
Final hold (min)   5. 10.
I 1339.1331.1303.1347.1335.
ReferenceWanakhachornkrai and Lertsiri, 2003Ito, Sugimoto, et al., 2002Qian and Reineccius, 2002Sanz, Maeztu, et al., 2002Chyau and Mau, 2001
Comment MSDC-RI MSDC-RI MSDC-RI MSDC-RI MSDC-RI
Column type CapillaryCapillaryCapillaryCapillaryCapillary
Active phase HP-WaxHP-WaxDB-WaxDB-WaxCP-Wax 52CB
Column length (m) 60.60.30.60.50.
Carrier gas HeHeHe H2
Substrate
Column diameter (mm) 0.250.250.250.320.32
Phase thickness (μm) 0.50.50.25 0.22
Tstart (C) 40.40.50.30.60.
Tend (C) 190.190.180.170.190.
Heat rate (K/min) 3.3.3.2.2.
Initial hold (min) 6.6. 4.4.
Final hold (min)   40.60.21.
I 1347.1347.1300.1320.1306.
ReferenceMaeztu, Sanz, et al., 2001Sanz, Ansorena, et al., 2001Lee and Shibamoto, 2000Buttery, Orts, et al., 1999Hwan and Chou, 1999
Comment MSDC-RI MSDC-RI MSDC-RI MSDC-RI MSDC-RI
Column type CapillaryCapillaryCapillaryCapillaryCapillary
Active phase DB-WaxDB-WaxCP-Wax 52CBDB-WaxPEG-20M
Column length (m) 30.60.50.60.50.
Carrier gas   HeHeNitrogen
Substrate
Column diameter (mm) 0.530.250.320.250.25
Phase thickness (μm)   0.25 0.25
Tstart (C) 60.30.50.60.60.
Tend (C) 210.170.210.180.180.
Heat rate (K/min) 4.2.1.52.2.
Initial hold (min)  4.5.
Final hold (min)  30.10.
I 1333.1320.1335.1339.1297.
ReferenceIwatsuki, Mizota, et al., 1999Buttery and Ling, 1998Chyau, Lin, et al., 1997Sekiwa, Kubota, et al., 1997Kubota, Matsujage, et al., 1996
Comment MSDC-RI MSDC-RI MSDC-RI MSDC-RI MSDC-RI
Column type CapillaryCapillaryCapillaryCapillaryCapillary
Active phase DB-WaxTC-WaxCarbowax 20MPEG-20MDB-Wax
Column length (m) 30.60.60.50.60.
Carrier gas He  HeHe
Substrate
Column diameter (mm) 0.320.250.250.250.25
Phase thickness (μm) 0.5  0.15
Tstart (C) 40.80.60.60.40.
Tend (C) 210.240.180.180.200.
Heat rate (K/min) 3.3.2.2.2.
Initial hold (min) 1.5.4.4.2.
Final hold (min) 25.
I 1317.1324.1308.1291.1320.
ReferencePollak and Berger, 1996Shuichi, Masazumi, et al., 1996Kawakami, Ganguly, et al., 1995Togari, Kobayashi, et al., 1995Umano, Hagi, et al., 1995
Comment MSDC-RI MSDC-RI MSDC-RI MSDC-RI MSDC-RI
Column type CapillaryCapillaryCapillaryCapillaryCapillary
Active phase Carbowax 20MDB-WaxDB-WaxCarbowax 20MCarbowax 20M
Column length (m) 80.60.30.50.50.
Carrier gas  HeHeHeHe
Substrate
Column diameter (mm) 0.20.250.250.330.25
Phase thickness (μm)
Tstart (C) 70.60.60.60.60.
Tend (C) 170.180.240.200.180.
Heat rate (K/min) 2.4.3.3.2.
Initial hold (min)  4.10. 4.
Final hold (min)  30.
I 1306.1318.1303.1293.1308.
ReferenceEgolf and Jurs, 1993Eiserich, Macku, et al., 1992Hatsuko, Kazuko, et al., 1992Vernin, Metzger, et al., 1992Kawakami and Kobayashi, 1991
Comment MSDC-RI MSDC-RI MSDC-RI MSDC-RI MSDC-RI
Column type CapillaryCapillaryCapillaryCapillaryCapillary
Active phase PEG-20MDB-WaxCarbowax 20MFFAPFFAP
Column length (m) 50. 50.50.50.
Carrier gas N230 HeHe
Substrate
Column diameter (mm) 0.250.250.220.280.28
Phase thickness (μm)
Tstart (C) 60.30.80.60.60.
Tend (C) 180.240.200.240.240.
Heat rate (K/min) 2.50.2.2.2.
Initial hold (min)  10. 5.5.
Final hold (min)
I 1297.1291.1290.1297.1297.
ReferenceKubota, Nakamoto, et al., 1991Pfannhauser, 1990Mihara and Masuda, 1988Vernin, Metzger, et al., 1988Vernin, Metzger, et al., 1988
Comment MSDC-RI MSDC-RI MSDC-RI MSDC-RI MSDC-RI
Column type CapillaryCapillaryCapillaryCapillaryCapillary
Active phase DB-WaxCarbowax 20MCarbowax 20MCarbowax 20MCarbowax 20M
Column length (m) 30.50.50.150.150.
Carrier gas HeHydrogenN2 He
Substrate
Column diameter (mm) 0.250.200.220.640.64
Phase thickness (μm)
Tstart (C) 70.50.80.50.50.
Tend (C) 160.200.200.170.170.
Heat rate (K/min) 2.1.2.1.1.
Initial hold (min) 8.  30.10.
Final hold (min)  35. 60.60.
I 1320.1325.1290.1325.1320.
ReferenceWong and Bernhard, 1988Wu, Liou, et al., 1987Mihara and Enomoto, 1985Buttery, Ling, et al., 1983Seifert and King, 1982
Comment MSDC-RI MSDC-RI MSDC-RI MSDC-RI MSDC-RI
Column type CapillaryCapillaryCapillary
Active phase Carbowax 20MCarbowax 20MCarbowax 20M
Column length (m) 39.100.100.
Carrier gas H2
Substrate
Column diameter (mm) 0.300.250.25
Phase thickness (μm)
Tstart (C) 60.70.70.
Tend (C) 220.170.170.
Heat rate (K/min) 2.1.1.
Initial hold (min)
Final hold (min)
I 1312.1320.1321.
ReferenceLiardon and Ledermann, 1980Shibamoto and Russell, 1977Shibamoto and Russell, 1977
Comment MSDC-RI MSDC-RI MSDC-RI

References

Weast and Grasselli, 1989
CRC Handbook of Data on Organic Compounds, 2nd Editon, Weast,R.C and Grasselli, J.G., ed(s)., CRC Press, Inc., Boca Raton, FL, 1989, 1. [all data]
Anderson and Shimanskaya, 1969
Anderson, A.A.; Shimanskaya, M.V.,
Gas-Liquid Chromatography of some Aliphatic and Heterocyclic Polyfunctional Amines: II. Solution Thermodyn. of Amines in Fix. Phas.,
Latv. PSR Zinat. Akad. Vestis, Kim. Ser., 1969, No. 5, 527. [all data]
Bruhl, 1895
Bruhl, J.W.,
Spectrochemistry of Nitrogen-Containing Compounds. I.,
Z. Phys. Chem., Stoechiom. Verwandtschaftsl., 1895, 16, 193. [all data]
Lanum and Morris, 1969
Lanum, W.J.; Morris, J.C.,
Physical Properties of Some Sulfur and Nitrogen Compounds,
J. Chem. Eng. Data, 1969, 14, 93-8. [all data]
Lipkind and Chickos, 2009
Lipkind, Dmitri; Chickos, James S.,
An examination of the vaporization enthalpies and vapor pressures of pyrazine, pyrimidine, pyridazine, and 1,3,5-triazine,
Struct Chem, 2009, 20, 1, 49-58, https://doi.org/10.1007/s11224-008-9389-5
. [all data]
Sakoguchi, Ueoka, et al., 1995
Sakoguchi, Akihiro; Ueoka, Ryuichi; Kato, Yasuo; Arai, Yasuhiko,
Vapor Pressures of Alkylpyridines and Alkylpyrazines.,
KAGAKU KOGAKU RONBUNSHU, 1995, 21, 1, 219-223, https://doi.org/10.1252/kakoronbunshu.21.219
. [all data]