Nonanoic acid, ethyl ester
- Formula: C11H22O2
- Molecular weight: 186.2912
- IUPAC Standard InChIKey: BYEVBITUADOIGY-UHFFFAOYSA-N
- CAS Registry Number: 123-29-5
- Chemical structure:
View 3d structure (requires JavaScript / HTML 5) - Other names: Ethyl nonanoate; Ethyl nonylate; Ethyl pelargonate; Wine ether; Ethyl n-nonanoate

Gas phase thermochemistry data

Data compiled by: Hussein Y. Afeefy, Joel F. Liebman, and Stephen E. Stein
Quantity | Value | Units | Method | Reference | Comment |
---|---|---|---|---|---|
ΔfH°gas | -590. ± 3. | kJ/mol | Cm | Wiberg and Waldron, 1991 | Heat of hydrolysis |

Condensed phase thermochemistry data

Data compiled by: Hussein Y. Afeefy, Joel F. Liebman, and Stephen E. Stein
Quantity | Value | Units | Method | Reference | Comment |
---|---|---|---|---|---|
ΔfH°liquid | -653.9 ± 2.1 | kJ/mol | Cm | Wiberg and Waldron, 1991 | Heat of hydrolysis |

Phase change data

Data compiled as indicated in comments:
TRC - Thermodynamics Research Center, NIST Boulder Laboratories, Chris Muzny director
BS - Robert L. Brown and Stephen E. Stein
ALS - Hussein Y. Afeefy, Joel F. Liebman, and Stephen E. Stein
DRB - Donald R. Burgess, Jr.
Quantity | Value | Units | Method | Reference | Comment |
---|---|---|---|---|---|
Tboil | 500.15 | K | N/A | Strating, Backer, et al., 1936 | Uncertainty assigned by TRC = 1. K; TRC |
Tboil | 500.15 | K | N/A | Deffet, 1931 | Uncertainty assigned by TRC = 1. K; TRC |
Tboil | 500.15 | K | N/A | Perkin, 1884 | Uncertainty assigned by TRC = 2. K; TRC |
Tboil | 490.15 | K | N/A | Cahours, 1850 | Uncertainty assigned by TRC = 8. K; TRC |
Quantity | Value | Units | Method | Reference | Comment |
Tfus | 228.70 | K | N/A | Timmermans, 1922 | Uncertainty assigned by TRC = 0.2 K; TRC |
Quantity | Value | Units | Method | Reference | Comment |
Tc | 663.9 | K | N/A | Young, 1994 | Uncertainty assigned by TRC = 3. K; TRC |
Tc | 673.96 | K | N/A | Brown, 1906 | Uncertainty assigned by TRC = 6. K; TRC |
Quantity | Value | Units | Method | Reference | Comment |
ΔvapH° | 64. ± 1. | kJ/mol | V | Wiberg and Waldron, 1991 | Heat of hydrolysis; ALS |
ΔvapH° | 63.9 | kJ/mol | N/A | Wiberg and Waldron, 1991 | DRB |
Reduced pressure boiling point
Tboil (K) | Pressure (bar) | Reference | Comment |
---|---|---|---|
392.2 | 0.031 | Aldrich Chemical Company Inc., 1990 | BS |

Kovats' RI, non-polar column, isothermal

Data compiled by: NIST Mass Spectrometry Data Center, William E. Wallace, director

Column type CapillaryCapillaryCapillaryCapillaryCapillary
Active phase SE-30SE-30SE-30SE-30SE-30
Column length (m) 25.25.25.25.25.
Carrier gas N2N2N2N2N2
Substrate
Column diameter (mm) 0.330.330.330.330.33
Phase thickness (μm)
Temperature (C) 140.160.180.200.220.
I 1274.1277.1284.1284.1304.
ReferenceKorhonen, 1985Korhonen, 1985Korhonen, 1985Korhonen, 1985Korhonen, 1985
Comment MSDC-RI MSDC-RI MSDC-RI MSDC-RI MSDC-RI
Column type CapillaryPacked
Active phase OV-101E-301
Column length (m) 15.2.
Carrier gas N2He
Substrate  Celite 545 (0.20-0.50 mm)
Column diameter (mm) 0.22
Phase thickness (μm)
Temperature (C) 200.170.
I 1277.1279.
ReferenceKomárek, Hornová, et al., 1982Shashkova, Znamenskaia, et al., 1969
Comment MSDC-RI MSDC-RI

Normal alkane RI, polar column, temperature ramp

Data compiled by: NIST Mass Spectrometry Data Center, William E. Wallace, director

Column type CapillaryCapillaryCapillaryCapillaryCapillary
Active phase DB-WaxCP-Wax 57 CBDB-WaxRTX-WaxDB-Wax
Column length (m) 30.50.30.30.30.
Carrier gas HeliumHydrogenHeHeHe
Substrate
Column diameter (mm) 0.250.250.250.250.32
Phase thickness (μm) 0.250.200.250.50.25
Tstart (C) 40.35.30.40.40.
Tend (C) 230.150.210.220.230.
Heat rate (K/min) 3.4.5.10.4.
Initial hold (min) 2.5. 5.2.
Final hold (min) 5.17.5 10.15.
I 1535.1536.1541.1532.1509.
ReferenceZhao, Xu, et al., 2009Callejon, Morales, et al., 2008Kumazawa, Itobe, et al., 2008Prososki, Etzel, et al., 2007Fan and Qian, 2006
Comment MSDC-RI MSDC-RI MSDC-RI MSDC-RI MSDC-RI
Column type CapillaryCapillaryCapillaryCapillaryCapillary
Active phase DB-WaxDB-WaxZB-WaxZB-WaxDB-Wax
Column length (m) 30.30.30.30.30.
Carrier gas N2N2HeliumHeliumHelium
Substrate
Column diameter (mm) 0.320.320.320.320.25
Phase thickness (μm) 0.250.250.250.250.25
Tstart (C) 40.40.40.40.25.
Tend (C) 230.230.250.250.220.
Heat rate (K/min) 6.4.5.5.4.
Initial hold (min) 2.2.2.2.
Final hold (min) 15.5.5.5.30.
I 1533.1521.1520.1521.1525.
ReferenceFan and Qian, 2006, 2Fan and Qian, 2005N/AN/ADuque, Bonilla, et al., 2001
Comment MSDC-RI MSDC-RI MSDC-RI MSDC-RI MSDC-RI
Column type CapillaryCapillaryCapillaryCapillaryCapillary
Active phase Supelcowax-10Carbowax 20MCarbowax 20MCarbowax 20MCarbowax 20M
Column length (m) 60.50.50.50.50.
Carrier gas HeN2N2N2N2
Substrate
Column diameter (mm) 0.250.220.220.220.22
Phase thickness (μm) 0.25
Tstart (C) 60.80.80.80.80.
Tend (C) 280.200.200.200.200.
Heat rate (K/min) 4.3.3.3.3.
Initial hold (min)
Final hold (min)
I 1545.1527.1529.1527.1529.
ReferenceKorány, Mednyánszky, et al., 2000Mihara, Tateba, et al., 1988Mihara, Tateba, et al., 1988Mihara, Tateba, et al., 1987Mihara, Tateba, et al., 1987
Comment MSDC-RI MSDC-RI MSDC-RI MSDC-RI MSDC-RI

Van Den Dool and Kratz RI, polar column, temperature ramp

Data compiled by: NIST Mass Spectrometry Data Center, William E. Wallace, director

Column type CapillaryCapillaryCapillaryCapillary
Active phase InnowaxSupelcowax-10ZB-WaxOV-351
Column length (m) 30.30.30.25.
Carrier gas HeHeHeN2
Substrate
Column diameter (mm) 0.250.250.250.32
Phase thickness (μm) 0.250.250.15
Tstart (C) 40.60.35.100.
Tend (C) 200.240.220.230.
Heat rate (K/min) 5.3.1.86.
Initial hold (min) 5.5.10.
Final hold (min) 2.10.10.
I 1531.1530.1530.1563.
ReferencePena, Barciela, et al., 2005Riu-Aumatell, Lopez-Tamames, et al., 2005Ledauphin, Saint-Clair, et al., 2004Korhonen, 1985
Comment MSDC-RI MSDC-RI MSDC-RI MSDC-RI

References

Wiberg and Waldron, 1991
Wiberg, K.B.; Waldron, R.F.,
Lactones. 2. Enthalpies of hydrolysis, reduction, and formation of the C4-C13 monocyclic lactones. strain energies and conformations,
J. Am. Chem. Soc., 1991, 113, 7697-7705. [all data]
Strating, Backer, et al., 1936
Strating, J.; Backer, H.J.; Lolkema, J.; Benninga, N.,
Prep. of Several Crystalline Aliphatic Hydrocarbons in the Pure State,
Recl. Trav. Chim. Pays-Bas, 1936, 55, 903-14. [all data]
Deffet, 1931
Deffet, L.,
The Freezing Points of Organic Compounds XIII. Compounds With Seven Eight, Nine or Ten Carbon Atoms,
Bull. Soc. Chim. Belg., 1931, 40, 385-402. [all data]
Perkin, 1884
Perkin, W.H.,
On the Magnetic Rotary Polarisation of Compounds in Relation to their Chemical Consitution; with Observations on the Preparation and Relative Densities of the Bodies Examined,
J. Chem. Soc., 1884, 45, 421-580. [all data]
Cahours, 1850
Cahours, A.,
Researches on Pelargonic Acid,
J. Chem. Soc., 1850, 3, 240. [all data]
Timmermans, 1922
Timmermans, J.,
Investigation of the Freezing Point of Organic Substances VII,
Bull. Soc. Chim. Belg., 1922, 31, 389. [all data]
Young, 1994
Young, C.L.,
Personal Commun. 1994 1994, 1994. [all data]
Brown, 1906
Brown, J.C.,
The critical temperature and value of ml/theta of some carbon compounds,
J. Chem. Soc., Trans., 1906, 89, 311. [all data]
Aldrich Chemical Company Inc., 1990
Aldrich Chemical Company Inc.,
Catalog Handbook of Fine Chemicals, Aldrich Chemical Company, Inc., Milwaukee WI, 1990, 1. [all data]