Butanedioic acid, diethyl ester
- Formula: C8H14O4
- Molecular weight: 174.1944
- IUPAC Standard InChIKey: DKMROQRQHGEIOW-UHFFFAOYSA-N
- CAS Registry Number: 123-25-1
- Chemical structure:
View 3d structure (requires JavaScript / HTML 5) - Other names: Succinic acid, diethyl ester; Clorius; Diethyl succinate; Ethyl succinate; Diethyl butanedioate; Diethylester kyseliny jantarove; Diethyl ester of butanedioic acid

Condensed phase thermochemistry data

Data compiled by: Eugene S. Domalski and Elizabeth D. Hearing
Constant pressure heat capacity of liquid
Cp,liquid (J/mol*K) | Temperature (K) | Reference |
---|---|---|
330.5 | 298.15 | Fuchs, 1979 |
338.1 | 292.6 | Kolosovskii and Udovenko, 1934 |
338.1 | 292.6 | de Kolossowsky and Udowenko, 1933 |

Phase change data

Data compiled as indicated in comments:
BS - Robert L. Brown and Stephen E. Stein
TRC - Thermodynamics Research Center, NIST Boulder Laboratories, Chris Muzny director
AC - William E. Acree, Jr., James S. Chickos
Quantity | Value | Units | Method | Reference | Comment |
---|---|---|---|---|---|
Tboil | 490.9 | K | N/A | Weast and Grasselli, 1989 | BS |
Tboil | 489. | K | N/A | Fenton, 1968 | Uncertainty assigned by TRC = 8. K; TRC |
Tboil | 490.9 | K | N/A | Timmermans, 1927 | Uncertainty assigned by TRC = 0.6 K; source of data not clear; TRC |
Tboil | 490.40 | K | N/A | Lecat, 1926 | Uncertainty assigned by TRC = 0.5 K; TRC |
Tboil | 490.30 | K | N/A | Timmermans, 1922 | Uncertainty assigned by TRC = 0.25 K; TRC |
Quantity | Value | Units | Method | Reference | Comment |
Tfus | 251.2 | K | N/A | Timmermans, 1927 | Uncertainty assigned by TRC = 0.5 K; TRC |
Tfus | 251.9 | K | N/A | Timmermans, 1922 | Uncertainty assigned by TRC = 0.4 K; TRC |
Quantity | Value | Units | Method | Reference | Comment |
Tc | 665. | K | N/A | Steele, Chirico, et al., 1994 | Uncertainty assigned by TRC = 2. K; TRC |
Tc | 663. | K | N/A | Radice, 1899 | Uncertainty assigned by TRC = 5. K; TRC |
Quantity | Value | Units | Method | Reference | Comment |
Pc | 22.60 | bar | N/A | Steele, Chirico, et al., 1994 | Uncertainty assigned by TRC = 0.05 bar; TRC |
Quantity | Value | Units | Method | Reference | Comment |
ρc | 1.76 | mol/l | N/A | Steele, Chirico, et al., 1994 | Uncertainty assigned by TRC = 0.02 mol/l; TRC |
Reduced pressure boiling point
Tboil (K) | Pressure (bar) | Reference | Comment |
---|---|---|---|
378.2 | 0.020 | Weast and Grasselli, 1989 | BS |
Enthalpy of vaporization
ΔvapH (kJ/mol) | Temperature (K) | Method | Reference | Comment |
---|---|---|---|---|
56.5 | 342. | A | Stephenson and Malanowski, 1987 | Based on data from 327. to 490. K. See also Stull, 1947.; AC |
Antoine Equation Parameters
log10(P) = A − (B / (T + C))
P = vapor pressure (bar)
T = temperature (K)
View plot Requires a JavaScript / HTML 5 canvas capable browser.
Temperature (K) | A | B | C | Reference | Comment |
---|---|---|---|---|---|
327.8 to 489.7 | 5.55964 | 2629.815 | -16.062 | Stull, 1947 | Coefficents calculated by NIST from author's data. |

Reaction thermochemistry data

Data compiled by: Hussein Y. Afeefy, Joel F. Liebman, and Stephen E. Stein

Individual Reactions

Hydrogen + Diethyl fumarate = Butanedioic acid, diethyl ester

By formula: H2 + C8H12O4 = C8H14O4

Quantity Value Units Method Reference Comment
Δr-121.1 ± 0.2kJ/molChydTurner, Meador, et al., 1957liquid phase; solvent: Acetic acid
Δr-122.60 ± 0.62kJ/molChydWilliams, 1942liquid phase; solvent: Acetic acid; At 302 K

Hydrogen + 2-Butenedioic acid (Z)-, diethyl ester = Butanedioic acid, diethyl ester

By formula: H2 + C8H12O4 = C8H14O4

Quantity Value Units Method Reference Comment
Δr-140.24 ± 0.64kJ/molChydWilliams, 1942liquid phase; solvent: Acetic acid; At 302 K

Normal alkane RI, non-polar column, temperature ramp

Data compiled by: NIST Mass Spectrometry Data Center, William E. Wallace, director

Column type CapillaryCapillaryCapillaryCapillaryCapillary
Active phase RTX-5DB-5DB-5DB-5DB-5
Column length (m) 10.30.30.30.30.
Carrier gas HeHeN2 N2
Substrate
Column diameter (mm) 0.180.320.320.250.32
Phase thickness (μm) 0.21.1.0.250.25
Tstart (C) 40.40.40.40.40.
Tend (C) 275.250.230.240.250.
Heat rate (K/min) 50.4.6.4.4.
Initial hold (min) 0.52.2.2.2.
Final hold (min) 0.515.15. 5.
I 1191.1176.1188.1191.1176.
ReferenceSetkova, Risticevic, et al., 2007Fan and Qian, 2006Fan and Qian, 2006, 2El-Sayed, Heppelthwaite, et al., 2005Fan and Qian, 2005
Comment MSDC-RI MSDC-RI MSDC-RI MSDC-RI MSDC-RI
Column type CapillaryCapillaryCapillaryCapillary
Active phase SPB-5HP-5Ultra-1DB-5
Column length (m) 30.25.25.30.
Carrier gas He HeHydrogen
Substrate
Column diameter (mm) 0.320.200.320.35
Phase thickness (μm) 0.250.330.251.0
Tstart (C) 40.50.80.45.
Tend (C) 220.180.260.220.
Heat rate (K/min) 5.5.3.2.
Initial hold (min) 1.3.
Final hold (min) 20.
I 1182.1181.1145.1172.
ReferenceLedauphin, Guichard, et al., 2003Jung, Wichmann, et al., 1999Okumura, 1991Georgilopoulos and Gallois, 1988
Comment MSDC-RI MSDC-RI MSDC-RI MSDC-RI

Van Den Dool and Kratz RI, polar column, custom temperature program

Data compiled by: NIST Mass Spectrometry Data Center, William E. Wallace, director

Column type CapillaryCapillaryCapillaryCapillaryCapillary
Active phase DB-WaxDB-WaxSupelcowax-10DB-WaxDB-Wax
Column length (m) 30.30.30.60.30.
Carrier gas H2H2HeHeH2
Substrate
Column diameter (mm) 0.320.320.250.250.32
Phase thickness (μm) 0.50.50.250.250.5
Program 60C(3min) => 2C/min => 220C => 3C/min => 245C (20min)60C(3min) => 2C/min => 220C => 3C/min => 245C(20min)35C(8min) => 3C/min => 134C => 20C/min => 250C(3.2min)35C(0.7min) => 20C/min => 70C => 4C/min => 240C60C(3min) => 2C/min => 220C => 3C/min => 245C (20min)
I 1690.1690.1677.1667.1690.
ReferenceSelli, Canbas, et al., 2006Selli, Canbas, et al., 2006, 2Howard, Mike, et al., 2005Ferrari, Lablanquie, et al., 2004Selli, Cabaroglu, et al., 2004
Comment MSDC-RI MSDC-RI MSDC-RI MSDC-RI MSDC-RI
Column type Capillary
Active phase Carbowax 20M
Column length (m) 25.
Carrier gas H2
Substrate
Column diameter (mm) 0.32
Phase thickness (μm) 0.25
Program 40C (8min) => 3C/min => 180C => 20C/min => 230C
I 1714.
ReferenceBoido, Lloret, et al., 2003
Comment MSDC-RI

Normal alkane RI, non-polar column, isothermal

Data compiled by: NIST Mass Spectrometry Data Center, William E. Wallace, director

Column type CapillaryCapillaryCapillaryCapillaryCapillary
Active phase OV-101OV-101OV-101OV-101OV-101
Column length (m) 50.50.50.50.50.
Carrier gas HeliumHeliumHeliumHeliumHelium
Substrate
Column diameter (mm) 0.250.250.250.250.25
Phase thickness (μm)
Temperature (C) 120.130.140.150.220.
I 1148.1149.1147.1145.1149.
ReferenceLipp, Krasnykh, et al., 2008Lipp, Krasnykh, et al., 2008Lipp, Krasnykh, et al., 2008Lipp, Krasnykh, et al., 2008Lipp, Krasnykh, et al., 2008
Comment MSDC-RI MSDC-RI MSDC-RI MSDC-RI MSDC-RI

Kovats' RI, non-polar column, isothermal

Data compiled by: NIST Mass Spectrometry Data Center, William E. Wallace, director

Column type Packed
Active phase SE-30
Column length (m) 2.
Carrier gas
Substrate
Column diameter (mm)
Phase thickness (μm)
Temperature (C) 220.
I 1149.
ReferenceZulaïca and Guiochon, 1963
Comment MSDC-RI

References

Fuchs, 1979
Fuchs, R.,
Heat capacities of some liquid aliphatic, alicyclic, and aromatic esters at 298.15 K,
J. Chem. Thermodyn., 1979, 11, 959-961. [all data]
Kolosovskii and Udovenko, 1934
Kolosovskii, N.A.; Udovenko, W.W.,
Specific heat of liquids. II.,
Zhur. Obshchei Khim., 1934, 4, 1027-1033. [all data]
de Kolossowsky and Udowenko, 1933
de Kolossowsky, N.A.; Udowenko, W.W.,
Mesure des chaleurs specifique moleculaires de quelques liquides,
Compt. rend., 1933, 197, 519-520. [all data]
Weast and Grasselli, 1989
CRC Handbook of Data on Organic Compounds, 2nd Editon, Weast,R.C and Grasselli, J.G., ed(s)., CRC Press, Inc., Boca Raton, FL, 1989, 1. [all data]
Fenton, 1968
Fenton, D.M.,
, 1968. [all data]
Timmermans, 1927
Timmermans, J.,
The Melting Point of Organic Substances,
Bull. Soc. Chim. Belg., 1927, 36, 502. [all data]
Lecat, 1926
Lecat, M.,
New binary azeotropes: 3rd list,
Ann. Soc. Sci. Bruxelles, Ser. B, 1926, 45, 284-94. [all data]
Timmermans, 1922
Timmermans, J.,
Investigation of the Freezing Point of Organic Substances VII,
Bull. Soc. Chim. Belg., 1922, 31, 389. [all data]
Steele, Chirico, et al., 1994
Steele, W.V.; Chirico, R.D.; Hossenlopp, I.A.; Knipmeyer, S.E.; Nguyen, A.; Smith, N.K.,
DIPPR project 871. Determination of ideal-gas enthalpies of formation for key compounds. The 1990 project results,
Experimental Results for DIPPR 1990-91 Projects on Phase Equilibria and Pure Component Properties, 1994, 1994, DIPPR Data Ser. No. 2, p. 188-215. [all data]
Radice, 1899
Radice, G.,
, Ph. D. Thesis, Univ. of Geneve, 1899. [all data]
Stephenson and Malanowski, 1987
Stephenson, Richard M.; Malanowski, Stanislaw,
Handbook of the Thermodynamics of Organic Compounds, 1987, https://doi.org/10.1007/978-94-009-3173-2
. [all data]
Stull, 1947
Stull, Daniel R.,
Vapor Pressure of Pure Substances. Organic and Inorganic Compounds,
Ind. Eng. Chem., 1947, 39, 4, 517-540, https://doi.org/10.1021/ie50448a022
. [all data]