4-Nonanol, 2,6,8-trimethyl-
- Formula: C12H26O
- Molecular weight: 186.3342
- IUPAC Standard InChIKey: LFEHSRSSAGQWNI-UHFFFAOYSA-N
- CAS Registry Number: 123-17-1
- Chemical structure:
View 3d structure (requires JavaScript / HTML 5) - Other names: 2,6,8-Trimethyl-4-nonanol; 4-Hydroxy-2,6,8-trimethylnonane; 2,4,8-Trimethyl-6-nonanol; 2,6,8-Trimethylnonanol-4; 2,6,8-trimethylnonan-4-ol

Phase change data

Data compiled by: Thermodynamics Research Center, NIST Boulder Laboratories, Chris Muzny director
Quantity | Value | Units | Method | Reference | Comment |
---|---|---|---|---|---|
Tboil | 498.65 | K | N/A | Anonymous, 1958 |

References

Anonymous, 1958
Anonymous, X.,
Am. Pet. Inst. Res. Proj. 50, 1958, Unpublished, 1958. [all data]