Benzene, tridecyl-
- Formula: C19H32
- Molecular weight: 260.4574
- IUPAC Standard InChIKey: MCVUKOYZUCWLQQ-UHFFFAOYSA-N
- CAS Registry Number: 123-02-4
- Chemical structure:
View 3d structure (requires JavaScript / HTML 5) - Other names: Tridecane, 1-phenyl-; Detergent Alkylate No. 5; Tridecylbenzene; 1-Phenyltridecane; n-Tridecylbenzene; Tridane

Phase change data

Data compiled by: William E. Acree, Jr., James S. Chickos
Quantity | Value | Units | Method | Reference | Comment |
---|---|---|---|---|---|
ΔvapH° | 94.6 | kJ/mol | N/A | Reid, 1972 |
Enthalpy of vaporization
ΔvapH (kJ/mol) | Temperature (K) | Reference | Comment |
---|---|---|---|
72.0 | 488. | Dykyj, Svoboda, et al., 1999 | Based on data from 473. to 651. K. |
90.0 | 358. | Pompili and Piacente, 1990 | Based on data from 343. to 463. K. |

Van Den Dool and Kratz RI, non-polar column, temperature ramp

Column type | Active phase | I | Reference | Comment |
---|---|---|---|---|
Capillary | DB-1 | 1978. | Peng, Hua, et al., 1992 | 30. m/0.32 mm/1.5 μm, 40. C @ 4. min, 8. K/min; Tend: 280. C |

Van Den Dool and Kratz RI, non-polar column, custom temperature program

Column type | Active phase | I | Reference | Comment |
---|---|---|---|---|
Capillary | DB-1 | 1971. | Peng, 2000 | 15. m/0.53 mm/1. μm, He; Program: 40C(3min) => 8C/min => 200(1min) => 5C/min => 300C(25min) |

Van Den Dool and Kratz RI, polar column, temperature ramp

Column type | Active phase | I | Reference | Comment |
---|---|---|---|---|
Capillary | DB-Wax | 2280. | Peng, 2000 | 15. m/0.53 mm/1. μm, He, 40. C @ 3. min, 5. K/min, 220. C @ 30. min |
Capillary | HP-Wax | 2277. | Peng, 2000 | 15. m/0.53 mm/1. μm, He, 40. C @ 3. min, 5. K/min, 220. C @ 30. min |
Capillary | DB-Wax | 2275. | Peng, Hua, et al., 1992 | 30. m/0.53 mm/1. μm, 40. C @ 4. min, 8. K/min, 200. C @ 20. min |

References

Reid, 1972
Reid, Robert C.,
Handbook on vapor pressure and heats of vaporization of hydrocarbons and related compounds, R. C. Wilhort and B. J. Zwolinski, Texas A Research Foundation. College Station, Texas(1971). 329 pages.$10.00,
AIChE J., 1972, 18, 6, 1278-1278, https://doi.org/10.1002/aic.690180637
. [all data]
Dykyj, Svoboda, et al., 1999
Dykyj, J.; Svoboda, J.; Wilhoit, R.C.; Frenkel, M.L.; Hall, K.R.,
Vapor Pressure of Chemicals: Part A. Vapor Pressure and Antoine Constants for Hydrocarbons and Sulfur, Selenium, Tellurium and Hydrogen Containing Organic Compounds, Springer, Berlin, 1999, 373. [all data]
Pompili and Piacente, 1990
Pompili, T.; Piacente, V.,
Enthalpy of vaporization of n-heptacosane and n-nonacosane from their vapour pressure determinations,
Thermochimica Acta, 1990, 170, 289-291, https://doi.org/10.1016/0040-6031(90)80548-D
. [all data]