Androstane-3,17-dione, (5β)-
- Formula: C19H28O2
- Molecular weight: 288.4244
- IUPAC Standard InChIKey: RAJWOBJTTGJROA-PLFHKJOISA-N
- CAS Registry Number: 1229-12-5
- Chemical structure:
View 3d structure (requires JavaScript / HTML 5) - Stereoisomers:
- Other names: 5β-Androstane-3,17-dione; Etiocholane-3,17-dione; Etiocholanedione; Etiochola-3,17-dione

Phase change data

Data compiled by: Thermodynamics Research Center, NIST Boulder Laboratories, Chris Muzny director
Quantity | Value | Units | Method | Reference | Comment |
---|---|---|---|---|---|
Tfus | 458. | K | N/A | Marker, Kamm, et al., 1937 | Uncertainty assigned by TRC = 5. K; Higher melting fraction |
Tfus | 401. | K | N/A | Marker, Kamm, et al., 1937 | Uncertainty assigned by TRC = 5. K; Lower melting fraction |
Tfus | 405. | K | N/A | Marker, Kamm, et al., 1937 | Uncertainty assigned by TRC = 6. K |

References

Marker, Kamm, et al., 1937
Marker, R.E.; Kamm, O.; Jones, D.M.; Oakwood, T.S.,
Sterols VIII. Preparation of Androstandione from allo-Preganadiol,
J. Am. Chem. Soc., 1937, 59, 614-6. [all data]