Acetamide, N-(4-formylphenyl)-
- Formula: C9H9NO2
- Molecular weight: 163.1733
- IUPAC Standard InChIKey: SKLUWKYNZNXSLX-UHFFFAOYSA-N
- CAS Registry Number: 122-85-0
- Chemical structure:
View 3d structure (requires JavaScript / HTML 5) - Other names: Acetanilide, 4'-formyl-; p-Acetamidobenzaldehyde; p-Formylacetanilide; Benzaldehyde, 4-acetamido-; Micotiazone; 4-(Acetalamino)benzaldehyde; 4-Acetamidobenzaldehyde; 4-Formylacetanilide; 4'-Formylacetanilide; p-Acetaminobenzaldehyde; p-(Acetylamino)benzaldehyde; para-Acetaminobenzaldehyde; 4-Acetylaminobenzaldehyde; 4-Acetomidobenzaldehyde; NSC 1701

Phase change data

Data compiled by: William E. Acree, Jr., James S. Chickos
Enthalpy of sublimation
ΔsubH (kJ/mol) | Temperature (K) | Method | Reference | Comment |
---|---|---|---|---|
99.0 | 337. | A | Stephenson and Malanowski, 1987 | Based on data from 328. to 346. K. See also Aihara, 1960. |

References

Stephenson and Malanowski, 1987
Stephenson, Richard M.; Malanowski, Stanislaw,
Handbook of the Thermodynamics of Organic Compounds, 1987, https://doi.org/10.1007/978-94-009-3173-2
. [all data]
Aihara, 1960
Aihara, Ariyuki,
Estimation of the Energy of Hydrogen Bonds Formed in Crystals. III. Amides,
Bull. Chem. Soc. Jpn., 1960, 33, 9, 1188-1194, https://doi.org/10.1246/bcsj.33.1188
. [all data]