N,N'-Bis-(4-methoxyphenyl)urea
- Formula: C15H16N2O3
- Molecular weight: 272.2991
- IUPAC Standard InChIKey: CPSIMDUNVYMPAH-UHFFFAOYSA-N
- CAS Registry Number: 1227-44-7
- Chemical structure:
View 3d structure (requires JavaScript / HTML 5) - Other names: N,N'-(Di-p-methoxyphenyl)urea

Reaction thermochemistry data

Data compiled by: Hussein Y. Afeefy, Joel F. Liebman, and Stephen E. Stein
Individual Reactions
By formula: C15H16N2O3 = C7H9NO + C8H7NO2
Quantity | Value | Units | Method | Reference | Comment |
---|---|---|---|---|---|
ΔrH° | 73.3 ± 1.1 | kJ/mol | Eqk | Chimishkyan, Svetlova, et al., 1984 | solid phase; Dissociation |

References

Chimishkyan, Svetlova, et al., 1984
Chimishkyan, A.L.; Svetlova, L.P.; Leonova, T.V.; Gluyaev, N.D.,
Thermal decomposition of substituted ureas,
J. Gen. Chem. USSR, 1984, 54, 1317-1320. [all data]