2-Propenoic acid, 3-phenyl-, 3-phenylpropyl ester

Van Den Dool and Kratz RI, non-polar column, custom temperature program

View large format table.

Column type Active phase I Reference Comment
CapillaryHP-5MS2323.6Andriamaharavo, 201430. m/0.25 mm/0.25 μm, He; Program: 60C (1 min) => 5 C/min => 210C => 10 C/min => 280C (15 min)

Normal alkane RI, non-polar column, temperature ramp

View large format table.

Column type Active phase I Reference Comment
CapillaryHP-12257.Fernandez, Lizzani-Cuvelier, et al., 200550. m/0.2 mm/0.25 μm, 60. C @ 60. min, 2. K/min; Tend: 250. C

References

Andriamaharavo, 2014
Andriamaharavo, N.R., Retention Data. NIST Mass Spectrometry Data Center., NIST Mass Spectrometry Data Center, 2014. [all data]

Fernandez, Lizzani-Cuvelier, et al., 2005
Fernandez, X.; Lizzani-Cuvelier, L.; Loiseau, A.-M.; Perichet, C.; Delbecque, C.; Arnaudo, J.-F., Chemical composition of the essential oils from Turkish and Honduras Styrax, Flavour Fragr. J., 2005, 20, 1, 70-73, https://doi.org/10.1002/ffj.1370 . [all data]