5-Phenoxymethyl-3-phenyl-2-oxazolidone
- Formula: C16H15NO3
- Molecular weight: 269.2952
- IUPAC Standard InChIKey: TVCILYMEQCWTGP-UHFFFAOYSA-N
- CAS Registry Number: 1226-26-2
- Chemical structure:
View 3d structure (requires JavaScript / HTML 5) - Other names: 3-Phenyl-5-phenoxymethyl-2-oxazolidinone

Condensed phase thermochemistry data

Data compiled as indicated in comments:
ALS - Hussein Y. Afeefy, Joel F. Liebman, and Stephen E. Stein
DH - Eugene S. Domalski and Elizabeth D. Hearing
Quantity | Value | Units | Method | Reference | Comment |
---|---|---|---|---|---|
ΔfH°solid | -417.6 ± 5.0 | kJ/mol | Ccb | Bykova, Kiparisova, et al., 1987 | ALS |
Quantity | Value | Units | Method | Reference | Comment |
ΔcH°solid | -8022.4 ± 5.0 | kJ/mol | Ccb | Bykova, Kiparisova, et al., 1987 | ALS |
Quantity | Value | Units | Method | Reference | Comment |
S°solid,1 bar | 330.0 | J/mol*K | N/A | Bykova, Kiparisova, et al., 1987, 2 | DH |
Constant pressure heat capacity of solid
Cp,solid (J/mol*K) | Temperature (K) | Reference | Comment |
---|---|---|---|
310.6 | 298.15 | Bykova, Kiparisova, et al., 1987, 2 | T = 0 to 330 K.; DH |

Reaction thermochemistry data

Data compiled by: Hussein Y. Afeefy, Joel F. Liebman, and Stephen E. Stein
Individual Reactions
By formula: C7H5NO + C9H10O2 = C16H15NO3
Quantity | Value | Units | Method | Reference | Comment |
---|---|---|---|---|---|
ΔrH° | -196.7 | kJ/mol | Cm | Lebedev, Bykova, et al., 1988 | liquid phase |

References

Bykova, Kiparisova, et al., 1987
Bykova, T.A.; Kiparisova, E.G.; Tarasov, E.N.; Pankratov, V.A.; Frenkel, Ts.M.; Fainleib, A.M.,
Thermodynamic properties of 3-phenyl-5-(phenoxymethyl)-2-oxazolidinone and 3-phenyl-5-(phenoxymethyl)-2-(phenylimino)oxazolidine in the range of 0-330 K,
Bull. Acad. Sci. USSR, Div. Chem. Sci., 1987, 1152-1154. [all data]
Bykova, Kiparisova, et al., 1987, 2
Bykova, T.A.; Kiparisova, Y.G.; Tarasov, E.N.; Pankratov, V.A.; Frenkel, Ts.M.; Fainleib, A.M.,
Thermodynamic properties of 3-phenyl-5-phenoxymethyl-2-oxazolidinone and 3-phenyl-5-phenoxymethyl-2-N-phenyliminooxazolidine between 0 and 300 K, Izv. Akad. Nauk SSSR,
Ser. Khim., 1987, (6), 1252-1254. [all data]
Lebedev, Bykova, et al., 1988
Lebedev, B.V.; Bykova, T.A.; Kiparisova, E.G.; Frenkel, Ts.M.; Fainleib, A.M.; Pankratov, V.A.,
Thermodynamics of phenyl glycidyl ether and its reactions with diphenylcarbodiimide and phenyl isocyanate with the formation of iminooxazolidine and oxazolidinone in the 0-330 K range,
Bull. Acad. Sci. USSR, Div. Chem. Sci., 1988, 1082-10. [all data]