Hydroxyl cation
- Formula: HO+
- Molecular weight: 17.0068
- IUPAC Standard InChIKey: XLYOFNOQVPJJNP-UHFFFAOYSA-O
- CAS Registry Number: 12259-29-9
- Chemical structure:
View 3d structure (requires JavaScript / HTML 5) - Species with the same structure:

Gas phase thermochemistry data

Quantity | Value | Units | Method | Reference | Comment |
---|---|---|---|---|---|
S°gas,1 bar | 182.78 | J/mol*K | Review | Chase, 1998 | Data last reviewed in December, 1970 |

Constants of diatomic molecules

Data compiled by: Klaus P. Huber and Gerhard H. Herzberg
Data collected through May, 1977
Symbol | Meaning |
---|---|
State | electronic state and / or symmetry symbol |
Te | minimum electronic energy (cm-1) |
ωe | vibrational constant – first term (cm-1) |
ωexe | vibrational constant – second term (cm-1) |
ωeye | vibrational constant – third term (cm-1) |
Be | rotational constant in equilibrium position (cm-1) |
αe | rotational constant – first term (cm-1) |
γe | rotation-vibration interaction constant (cm-1) |
De | centrifugal distortion constant (cm-1) |
βe | rotational constant – first term, centrifugal force (cm-1) |
re | internuclear distance (Å) |
Trans. | observed transition(s) corresponding to electronic state |
ν00 | position of 0-0 band (units noted in table) |
State | Te | ωe | ωexe | ωeye | Be | αe | γe | De | βe | re | Trans. | ν00 |
---|---|---|---|---|---|---|---|---|---|---|---|---|
b 1Σ+ | (29050) | [2981] 1 | [16.320] 1 | (0.732) 1 | [19.2E-4] 1 | 1.032 | (b-X) | 29058.8 1 | ||||
A 3Πi 0- | A → X 2 3 R | 28034.04 4 | ||||||||||
↳missing citation; missing citation | ||||||||||||
A 3Πi 0+ | A → X 2 3 R | 28028.31 4 | ||||||||||
↳missing citation; missing citation | ||||||||||||
A 3Πi 1 | 28438.55 | 2133.65 Z | 79.55 | 13.7916 5 6 | 0.8889 | .01730 | [22.495E-4] 7 | 1.1354 | A → X 2 3 R | 27948.43 4 | ||
↳missing citation; missing citation | ||||||||||||
State | Te | ωe | ωexe | ωeye | Be | αe | γe | De | βe | re | Trans. | ν00 |
A 3Πi 2 | A → X 2 3 R | 27864.31 4 | ||||||||||
↳missing citation; missing citation | ||||||||||||
a 1Δ | 17660 8 | |||||||||||
X 2Σ- | 0 | 3113.37 Z | 78.52 | 16.7943 9 | 0.7494 | .01097 | [19.174E-4] 10 | 1.0289 |

References

Chase, 1998
Chase, M.W., Jr.,
NIST-JANAF Themochemical Tables, Fourth Edition,
J. Phys. Chem. Ref. Data, Monograph 9, 1998, 1-1951. [all data]
Brzozowski, Elander, et al., 1974
Brzozowski, J.; Elander, N.; Erman, P.; Lyyra, M.,
Lifetimes of excited levels in some important ion-molecules part I: NH+, OH+ and SH+,
Phys. Scr., 1974, 10, 241-243. [all data]
Gerard, Govers, et al., 1976
Gerard, M.; Govers, T.R.; van de Runstraat, C.A.; Marx, R.,
Vibrational branching ratios for the A3Πi → X3Σ- system of OH+ and OD+,
Chem. Phys. Lett., 1976, 44, 1, 154-158. [all data]
Merer, Malm, et al., 1975
Merer, A.J.; Malm, D.N.; Martin, R.W.; Horani, M.; Rostas, J.,
The ultraviolet emission spectra of OH+ and OD+. Rotational structure and perturbations in the A3Πi - X3Σ- transition,
Can. J. Phys., 1975, 53, 251-283. [all data]
Katsumata and Lloyd, 1977
Katsumata, S.; Lloyd, D.R.,
The photoelectron spectra of the OH and OD radicals,
Chem. Phys. Lett., 1977, 45, 519. [all data]
Brzozowski, Erman, et al., 1975
Brzozowski, J.; Erman, P.; Lew, H.,
Lifetimes of excited states in D2O+ and OD+ and relative lifetimes between the normal and deuterated species,
Chem. Phys. Lett., 1975, 34, 2, 267-270. [all data]