Hydrogen bromide, positive ion

Ion clustering data

Data compiled by: Michael M. Meot-Ner (Mautner) and Sharon G. Lias

Clustering reactions

HBr+ + Hydrogen bromide = (HBr+ • Hydrogen bromide)

By formula: HBr+ + HBr = (HBr+ • HBr)

Quantity Value Units Method Reference Comment
Δr23.kcal/molPITiedemann, Anderson, et al., 1979gas phase

References

Tiedemann, Anderson, et al., 1979
Tiedemann, P.W.; Anderson, S.L.; Ceyer, S.T.; Hirooka, T.; Ng, C.Y.; Mahan, B.H.; Lee, Y.T., Proton affinities of hydrogen halides determined by the molecular beam photoionization method, J. Chem. Phys., 1979, 71, 605. [all data]