Dialuminum dioxide
- Formula: Al2O2
- Molecular weight: 85.9619
- CAS Registry Number: 12252-63-0

Gas phase thermochemistry data

Quantity | Value | Units | Method | Reference | Comment |
---|---|---|---|---|---|
ΔfH°gas | -394.55 | kJ/mol | Review | Chase, 1998 | Data last reviewed in December, 1979 |
Quantity | Value | Units | Method | Reference | Comment |
S°gas,1 bar | 280.90 | J/mol*K | Review | Chase, 1998 | Data last reviewed in December, 1979 |
Gas Phase Heat Capacity (Shomate Equation)
Cp° = A + B*t + C*t2 + D*t3 +
E/t2
H° − H°298.15= A*t + B*t2/2 +
C*t3/3 + D*t4/4 − E/t + F − H
S° = A*ln(t) + B*t + C*t2/2 + D*t3/3 −
E/(2*t2) + G
Cp = heat capacity (J/mol*K)
H° = standard enthalpy (kJ/mol)
S° = standard entropy (J/mol*K)
t = temperature (K) / 1000.
View plot Requires a JavaScript / HTML 5 canvas capable browser.
Temperature (K) | 298. to 6000. |
---|---|
A | 80.97797 |
B | 1.839923 |
C | -0.497222 |
D | 0.042360 |
E | -1.303940 |
F | -423.1447 |
G | 371.0380 |
H | -394.5516 |
Reference | Chase, 1998 |
Comment | Data last reviewed in December, 1979 |

References

Chase, 1998
Chase, M.W., Jr.,
NIST-JANAF Themochemical Tables, Fourth Edition,
J. Phys. Chem. Ref. Data, Monograph 9, 1998, 1-1951. [all data]