Ethyl orthoformate
- Formula: C7H16O3
- Molecular weight: 148.2001
- IUPAC Standard InChIKey: GKASDNZWUGIAMG-UHFFFAOYSA-N
- CAS Registry Number: 122-51-0
- Chemical structure:
View 3d structure (requires JavaScript / HTML 5) - Species with the same structure:
- Other names: Ethane, 1,1',1''-[methylidynetris(oxy)]tris-; Orthoformic acid, triethyl ester; Aethon; Ethone; Orthoformic acid ethyl ester; Triethoxymethane; Triethyl orthoformate; Triethoxmethane; Ethyl formate(ortho); Ethylester kyseliny orthomravenci; Methane, triethoxy-; Orthomravencan ethylnaty; 1,1',1''-(Methylidynetris(oxy))tris(ethane); Triethylester kyseliny orthomravenci; UN 2524; Triethyl ester of orthoformic acid; NSC 5289; 1-(Diethoxymethoxy)ethane

Gas phase thermochemistry data

Data compiled as indicated in comments:
DRB - Donald R. Burgess, Jr.
ALS - Hussein Y. Afeefy, Joel F. Liebman, and Stephen E. Stein
Quantity | Value | Units | Method | Reference | Comment |
---|---|---|---|---|---|
ΔfH°gas | -630.6 | kJ/mol | N/A | Gutner, Lebedeva, et al., 1980 | Value computed using ΔfHliquid° value of -675.8±0.8 kj/mol from Gutner, Lebedeva, et al., 1980 and ΔvapH° value of 45.2 kj/mol from Hine and Klueppet, 1974.; DRB |
ΔfH°gas | -641.8 | kJ/mol | Cm | Hine and Klueppet, 1974 | Heat of hydrolysis; ALS |
ΔfH°gas | -635.3 ± 3.8 | kJ/mol | Ccb | Pihlaja and Tuomi, 1971 | ALS |

Condensed phase thermochemistry data

Data compiled by: Hussein Y. Afeefy, Joel F. Liebman, and Stephen E. Stein
Quantity | Value | Units | Method | Reference | Comment |
---|---|---|---|---|---|
ΔfH°liquid | -675.8 ± 0.8 | kJ/mol | Ccb | Gutner, Lebedeva, et al., 1980 | |
ΔfH°liquid | -687.0 | kJ/mol | Cm | Hine and Klueppet, 1974 | Heat of hydrolysis |
ΔfH°liquid | -681.3 ± 2.9 | kJ/mol | Ccb | Pihlaja and Tuomi, 1971 | |
Quantity | Value | Units | Method | Reference | Comment |
ΔcH°liquid | -4365.5 ± 0.8 | kJ/mol | Ccb | Gutner, Lebedeva, et al., 1980 | Corresponding ΔfHºliquid = -675.7 kJ/mol (simple calculation by NIST; no Washburn corrections) |
ΔcH°liquid | -4359.9 ± 2.9 | kJ/mol | Ccb | Pihlaja and Tuomi, 1971 | Corresponding ΔfHºliquid = -681.32 kJ/mol (simple calculation by NIST; no Washburn corrections) |

Phase change data

Data compiled as indicated in comments:
BS - Robert L. Brown and Stephen E. Stein
TRC - Thermodynamics Research Center, NIST Boulder Laboratories, Chris Muzny director
AC - William E. Acree, Jr., James S. Chickos
ALS - Hussein Y. Afeefy, Joel F. Liebman, and Stephen E. Stein
DRB - Donald R. Burgess, Jr.
Quantity | Value | Units | Method | Reference | Comment |
---|---|---|---|---|---|
Tboil | 419.2 | K | N/A | Aldrich Chemical Company Inc., 1990 | BS |
Tboil | 417. to 419. | K | N/A | Frinton Laboratories Inc., 1986 | BS |
Tboil | 418.9 | K | N/A | Lecat, 1943 | Uncertainty assigned by TRC = 0.3 K; TRC |
Tboil | 418. | K | N/A | Pfeiffer and Adkins, 1931 | Uncertainty assigned by TRC = 2.5 K; TRC |
Tboil | 419. | K | N/A | Carswell and Adkins, 1928 | Uncertainty assigned by TRC = 2. K; TRC |
Quantity | Value | Units | Method | Reference | Comment |
Tfus | 197.1 | K | N/A | Timmermans, 1922 | Uncertainty assigned by TRC = 0.4 K; TRC |
Quantity | Value | Units | Method | Reference | Comment |
ΔvapH° | 46. ± 3. | kJ/mol | AVG | N/A | Average of 7 values; Individual data points |
Enthalpy of vaporization
ΔvapH (kJ/mol) | Temperature (K) | Method | Reference | Comment |
---|---|---|---|---|
49.0 | 308. | A | Stephenson and Malanowski, 1987 | Based on data from 293. to 323. K.; AC |
47.2 | 293. | A | Stephenson and Malanowski, 1987 | Based on data from 278. to 419. K. See also Stull, 1947.; AC |
Antoine Equation Parameters
log10(P) = A − (B / (T + C))
P = vapor pressure (bar)
T = temperature (K)
View plot Requires a JavaScript / HTML 5 canvas capable browser.
Temperature (K) | A | B | C | Reference | Comment |
---|---|---|---|---|---|
278.7 to 419. | 4.84152 | 1821.195 | -42.668 | Stull, 1947 | Coefficents calculated by NIST from author's data. |

Reaction thermochemistry data

Data compiled by: Hussein Y. Afeefy, Joel F. Liebman, and Stephen E. Stein
Individual Reactions
By formula: C7H16O3 + H2O = C3H6O2 + 2C2H6O
Quantity | Value | Units | Method | Reference | Comment |
---|---|---|---|---|---|
ΔrH° | -13.25 ± 0.79 | kJ/mol | Cm | Hine and Klueppet, 1974 | liquid phase; Heat of hydrolysis |

Van Den Dool and Kratz RI, non-polar column, custom temperature program

Column type | Active phase | I | Reference | Comment |
---|---|---|---|---|
Capillary | HP-5MS | 884.7 | Andriamaharavo, 2014 | 30. m/0.25 mm/0.25 μm, He; Program: 60C (1 min) => 5 C/min => 210C => 10 C/min => 280C (15 min) |

Normal alkane RI, polar column, custom temperature program

Column type | Active phase | I | Reference | Comment |
---|---|---|---|---|
Capillary | DB-Wax | 1274. | Welke, Manfroi, et al., 2012 | 30. m/0.25 mm/0.25 μm, Helium; Program: not specified |

References

Gutner, Lebedeva, et al., 1980
Gutner, N.M.; Lebedeva, N.D.; Dobychin, S.L.; Kiseleva, N.N.,
Thermochemical study of aliphatic ethers,
J. Appl. Chem. USSR, 1980, 53, 1523-1525. [all data]
Hine and Klueppet, 1974
Hine, J.; Klueppet, A.W.,
Structural effects on rates and equilibria. XVIII. Thermodynamic stability of ortho esters,
J. Am. Chem. Soc., 1974, 96, 2924-2929. [all data]
Pihlaja and Tuomi, 1971
Pihlaja, K.; Tuomi, M.,
Bond-bond interactions in organic oxygen compounds. Part V. Enthalpies of formation of methyl and ethyl orthoformates and the contributory group increments. The magnitude of the so-called rabbit-ear effect in acyclic oxygen compounds,
Acta Chem. Scand., 1971, 25, 465-469. [all data]
Aldrich Chemical Company Inc., 1990
Aldrich Chemical Company Inc.,
Catalog Handbook of Fine Chemicals, Aldrich Chemical Company, Inc., Milwaukee WI, 1990, 1. [all data]
Frinton Laboratories Inc., 1986
Frinton Laboratories Inc.,
Catalog Number 11, Frinton Laboratories Inc., Vineland, NJ, 1986, 99. [all data]
Lecat, 1943
Lecat, M.,
Negative and other Azeotropes,
C. R. Hebd. Seances Acad. Sci., 1943, 217, 242. [all data]
Pfeiffer and Adkins, 1931
Pfeiffer, G.J.; Adkins, H.,
The Relation of the Structure of Ketones to Their Reactivity and Affinity in Acetal Formation II.,
J. Am. Chem. Soc., 1931, 53, 1043. [all data]
Carswell and Adkins, 1928
Carswell, H.E.; Adkins, H.,
The Relation of the Structure of Ketones to their Reactivity and Affinity in Acetal Formation,
J. Am. Chem. Soc., 1928, 50, 235. [all data]
Timmermans, 1922
Timmermans, J.,
Investigation of the Freezing Point of Organic Substances VII,
Bull. Soc. Chim. Belg., 1922, 31, 389. [all data]
Stephenson and Malanowski, 1987
Stephenson, Richard M.; Malanowski, Stanislaw,
Handbook of the Thermodynamics of Organic Compounds, 1987, https://doi.org/10.1007/978-94-009-3173-2
. [all data]
Stull, 1947
Stull, Daniel R.,
Vapor Pressure of Pure Substances. Organic and Inorganic Compounds,
Ind. Eng. Chem., 1947, 39, 4, 517-540, https://doi.org/10.1021/ie50448a022
. [all data]
Andriamaharavo, 2014
Andriamaharavo, N.R.,
Retention Data. NIST Mass Spectrometry Data Center., NIST Mass Spectrometry Data Center, 2014. [all data]
Welke, Manfroi, et al., 2012
Welke, J.E.; Manfroi, V.; Zanus, M.; Lazarotto, M.; Zini, C.A.,
Characterization of the volatile profile of Brazilian merlot wines through comprehensive two dimensional gas chromatography time-of-flight mass spectrometric detection,
J. Chromatogr. A, 2012, 1226, 124-139, https://doi.org/10.1016/j.chroma.2012.01.002
. [all data]