Carbamic acid, phenyl-, 1-methylethyl ester
- Formula: C10H13NO2
- Molecular weight: 179.2157
- IUPAC Standard InChIKey: VXPLXMJHHKHSOA-UHFFFAOYSA-N
- CAS Registry Number: 122-42-9
- Chemical structure:
View 3d structure (requires JavaScript / HTML 5) - Other names: Carbanilic acid, isopropyl ester; Agermin; Birgin; Chem-Hoe; Collavin; Iso.PPC.; Isopropyl carbanilate; Isopropyl phenyl urethane; Isopropyl phenylcarbamate; Isopropyl phenylcarbmate; IFK; INPC; IPC; IPPC; Profam; Propham; Tixit; Tuberit; Tuberite; Y 2; Isopropyl N-phenylcarbamate; N-Phenylcarbamate d'isopropyle; O-Isopropyl N-phenylcarbamate; Ban-Hoe; Beet-Kleen; Isopropil-N-fenil-carbammato; Isopropyl carbanilic acid ester; Isopropyl-N-fenyl-carbamaat; Isopropyl-N-phenyl-carbamat; Isopropyl-N-phenylurethan; IFC; N-Phenyl isopropyl carbamate; N-Phenylcarbamic acid, isopropyl ester; Ortho grass killer; Phenylcarbamic acid,1-methylethyl ester; Prophame; Triherbide; Triherbide-IPC; USAF D-9; Isopropylester kyseliny karbanilove; Premalox; N-Phenyl-O-isopropylurethane; Carbamate pesticide IPC; 1-Methylethyl phenylcarbamate; ISO.PPC; IsoPPC; Carbamic acid, phenyl, isopropyl ester; Carbamic acid, N-phenyl-, 1-methylethyl ester

Condensed phase thermochemistry data

Data compiled by: Hussein Y. Afeefy, Joel F. Liebman, and Stephen E. Stein
Quantity | Value | Units | Method | Reference | Comment |
---|---|---|---|---|---|
ΔcH°solid | -1278.9 ± 0.5 | kcal/mol | Ccb | Zhuravlev, Serukhina, et al., 1965 |

Phase change data

Data compiled as indicated in comments:
TRC - Thermodynamics Research Center, NIST Boulder Laboratories, Chris Muzny director
AC - William E. Acree, Jr., James S. Chickos
Quantity | Value | Units | Method | Reference | Comment |
---|---|---|---|---|---|
Tfus | 360.45 | K | N/A | Donnelly, Drewes, et al., 1990 | Uncertainty assigned by TRC = 0.2 K; TRC |
Tfus | 357.7 | K | N/A | Plato and Glasgow, 1969 | Uncertainty assigned by TRC = 0.2 K; TRC |
Enthalpy of fusion
ΔfusH (kcal/mol) | Temperature (K) | Reference | Comment |
---|---|---|---|
4.630 | 359.5 | Acree, 1991 | AC |

Kovats' RI, non-polar column, isothermal

Column type | Active phase | Temperature (C) | I | Reference | Comment |
---|---|---|---|---|---|
Capillary | OV-1 | 160. | 1438. | Erdmann, Rochholz, et al., 1992 | |
Capillary | OV-1 | 190. | 1456. | Erdmann, Rochholz, et al., 1992 | |
Capillary | OV-1 | 220. | 1477. | Erdmann, Rochholz, et al., 1992 | |
Packed | SE-30 | 140. | 1431. | Gerqasimenko and Voskoboinikov, 1987 | Column length: 1. m |
Packed | SE-30 | 140. | 1432. | Gerqasimenko and Voskoboinikov, 1987 | Column length: 1. m |
Packed | SE-30 | 160. | 1434. | Gerqasimenko and Voskoboinikov, 1987 | Column length: 1. m |
Packed | SE-30 | 160. | 1437. | Gudovicheva and Boitsov, 1985 | Column length: 100. m |

Kovats' RI, polar column, isothermal

Column type | Active phase | Temperature (C) | I | Reference | Comment |
---|---|---|---|---|---|
Packed | PEG 4000 | 160. | 2000. | Gudovicheva and Boitsov, 1985 | N2, Inerton AW (0.16-0.20 mm); Column length: 1. m |

Van Den Dool and Kratz RI, non-polar column, temperature ramp

Column type | Active phase | I | Reference | Comment |
---|---|---|---|---|
Capillary | SLB-5MS | 1459. | Mondello, Casilli, et al., 2007 | 30. m/0.25 mm/0.25 μm, He, 2. K/min; Tstart: 70. C; Tend: 300. C |
Capillary | SLB-5MS | 1462. | Mondello, Casilli, et al., 2007 | 30. m/0.25 mm/0.25 μm, He, 2. K/min; Tstart: 70. C; Tend: 300. C |

Normal alkane RI, non-polar column, isothermal

Column type | Active phase | Temperature (C) | I | Reference | Comment |
---|---|---|---|---|---|
Packed | SE-30 | 164. | 1423. | Singlair, Macho, et al., 1989 | Nitrogen, Chromaton N AW DMCS; Column length: 2.5 m |
Packed | SE-30 | 182. | 1449. | Singlair, Macho, et al., 1989 | Nitrogen, Chromaton N AW DMCS; Column length: 2.5 m |
Packed | SE-30 | 200. | 1453. | Singlair, Macho, et al., 1989 | Nitrogen, Chromaton N AW DMCS; Column length: 2.5 m |

References

Zhuravlev, Serukhina, et al., 1965
Zhuravlev, E.Z.; Serukhina, S.Ya.; Konstantinov, I.I.,
Heats of combustion of certain phenylcarbamate esters (carbanilates),
J. Appl. Chem. USSR (Engl. Transl.), 1965, 38, 2775-2776. [all data]
Donnelly, Drewes, et al., 1990
Donnelly, J.R.; Drewes, L.A.; Johnson, R.L.; Munslow, W.D.; Knapp, K.K.; Sovocool, G.W.,
Purity and heat of fusion data for environmental standards as determined by differential scanning calorimetry,
Thermochim. Acta, 1990, 167, 2, 155, https://doi.org/10.1016/0040-6031(90)80476-F
. [all data]
Plato and Glasgow, 1969
Plato, C.; Glasgow, A.R., Jr.,
Differential scanning calorimetry as a general method for determining the purity and heat of fusion of high-purity organic chemicals. Application to 95 compounds,
Anal. Chem., 1969, 41, 2, 330, https://doi.org/10.1021/ac60271a041
. [all data]
Acree, 1991
Acree, William E.,
Thermodynamic properties of organic compounds: enthalpy of fusion and melting point temperature compilation,
Thermochimica Acta, 1991, 189, 1, 37-56, https://doi.org/10.1016/0040-6031(91)87098-H
. [all data]
Erdmann, Rochholz, et al., 1992
Erdmann, F.; Rochholz, G.; Schütz, H.,
Retention-indices on OV-1 of approximately 170 commonly used pesticides,
Mikrochim. Acta, 1992, 106, 3-6, 219-226, https://doi.org/10.1007/BF01242093
. [all data]
Gerqasimenko and Voskoboinikov, 1987
Gerqasimenko, V.A.; Voskoboinikov, V.V.,
Thermostability and gas chromatographic retention of substituted alkylarlcarbmates,
Zh. Anal. Khim., 1987, 62, 11, 2043-2047. [all data]
Gudovicheva and Boitsov, 1985
Gudovicheva, N.N.; Boitsov, E.N.,
Gas-liquid chromatography of secondary carbamates,
Zh. Anal. Khim., 1985, 40, 8, 1521-1524. [all data]
Mondello, Casilli, et al., 2007
Mondello, L.; Casilli, A.; Tranchida, P.Q.; Presti, M.L.; Dugo, P.; Dugo, G.,
Comprehensive gas chromatography coupled to mass spectrometry for the separation of pesticides in a very complex matrix,
Anal. Bioanal. Chem., 2007, 389, 6, 1755-1763, https://doi.org/10.1007/s00216-007-1412-y
. [all data]
Singlair, Macho, et al., 1989
Singlair, M.; Macho, V.; Terlandova, J.,
Fas chromatography of alkyl N-phenylcarbamates,
Chem. Papers, 1989, 43, 4, 519-525. [all data]