Bis(ethylbenzene)chromium
- Formula: C16H20Cr
- Molecular weight: 264.3261
- CAS Registry Number: 12212-68-9

Condensed phase thermochemistry data

Data compiled as indicated in comments:
MS - José A. Martinho Simões
DH - Eugene S. Domalski and Elizabeth D. Hearing
Quantity | Value | Units | Method | Reference | Comment |
---|---|---|---|---|---|
ΔfH°liquid | 59.5 ± 4.0 | kJ/mol | Review | Martinho Simões | MS |
Quantity | Value | Units | Method | Reference | Comment |
ΔcH°liquid | -9784.3 ± 3.3 | kJ/mol | CC-SB | Tel'noi, Rabinovich, et al., 1973 | Please also see Pedley and Rylance, 1977.; MS |
Quantity | Value | Units | Method | Reference | Comment |
S°liquid | 406.7 | J/mol*K | N/A | Nikolaev, Safonov, et al., 1972 | DH |
Constant pressure heat capacity of liquid
Cp,liquid (J/mol*K) | Temperature (K) | Reference | Comment |
---|---|---|---|
393.3 | 298.15 | Nikolaev, Safonov, et al., 1972 | T = 60 to 298.15 K.; DH |

Phase change data

Data compiled as indicated in comments:
DH - Eugene S. Domalski and Elizabeth D. Hearing
MS - José A. Martinho Simões
Quantity | Value | Units | Method | Reference | Comment |
---|---|---|---|---|---|
Tfus | 275.6 | K | N/A | Nikolaev, Safonov, et al., 1972 | DH |
Quantity | Value | Units | Method | Reference | Comment |
ΔvapH° | 75.3 ± 8.4 | kJ/mol | CC-SB | Tel'noi, Rabinovich, et al., 1973 | MS |

Gas phase thermochemistry data

Data compiled by: José A. Martinho Simões
Quantity | Value | Units | Method | Reference | Comment |
---|---|---|---|---|---|
ΔfH°gas | 134.8 ± 9.3 | kJ/mol | Review | Martinho Simões |

References

Martinho Simões
Martinho Simões, J.A.,
Private communication (see http://webbook.nist.gov/chemistry/om/). [all data]
Tel'noi, Rabinovich, et al., 1973
Tel'noi, V.I.; Rabinovich, I.B.; Umilin, V.A.,
Dokl. Akad. Nauk SSSR, 1973, 209, 197. [all data]
Pedley and Rylance, 1977
Pedley, J.B.; Rylance, J.,
Computer Analysed Thermochemical Data: Organic and Organometallic Compounds, University of Sussex, Brigton, 1977. [all data]
Nikolaev, Safonov, et al., 1972
Nikolaev, P.N.; Safonov, V.A.; Moseeva, E.M.; Rabinovich, I.B.,
Specific heat and solid-state transitions of bis(arene)chromium halides,
Tr. Khim. Khim. Tekhnol., 1972, (2), 54-60. [all data]