Ammonium cyanide
- Formula: CH4N2
- Molecular weight: 44.0559
- CAS Registry Number: 12211-52-8

Phase change data

Data compiled by: William E. Acree, Jr., James S. Chickos
Quantity | Value | Units | Method | Reference | Comment |
---|---|---|---|---|---|
ΔsubH° | 84.5 | kJ/mol | N/A | Luft, 1955 |
Enthalpy of vaporization
ΔvapH (kJ/mol) | Temperature (K) | Reference | Comment |
---|---|---|---|
47.1 | 237. | Stull, 1947 | Based on data from 222. to 305. K. |

References

Luft, 1955
Luft, N.W.,
Ind. Chemist, 1955, 31, 502. [all data]
Stull, 1947
Stull, Daniel R.,
Vapor Pressure of Pure Substances. Organic and Inorganic Compounds,
Ind. Eng. Chem., 1947, 39, 4, 517-540, https://doi.org/10.1021/ie50448a022
. [all data]