Urea, N,N'-bis(4-chlorophenyl)-
- Formula: C13H10Cl2N2O
- Molecular weight: 281.137
- IUPAC Standard InChIKey: ZNQCSLYENQIUMJ-UHFFFAOYSA-N
- CAS Registry Number: 1219-99-4
- Chemical structure:
View 3d structure (requires JavaScript / HTML 5) - Permanent link for this species. Use this link for bookmarking this species for future reference.

Reaction thermochemistry data

Data compiled by: Hussein Y. Afeefy, Joel F. Liebman, and Stephen E. Stein
Individual Reactions
By formula: C13H10Cl2N2O = C7H4ClNO + C6H6ClN
Quantity | Value | Units | Method | Reference | Comment |
---|---|---|---|---|---|
ΔrH° | 120.5 ± 1.1 | kJ/mol | Eqk | Chimishkyan, Svetlova, et al., 1984 | solid phase; Dissociation |

References

Chimishkyan, Svetlova, et al., 1984
Chimishkyan, A.L.; Svetlova, L.P.; Leonova, T.V.; Gluyaev, N.D.,
Thermal decomposition of substituted ureas,
J. Gen. Chem. USSR, 1984, 54, 1317-1320. [all data]