Benzenamine, 2-chloro-4-nitro-

Phase change data

Data compiled by: William E. Acree, Jr., James S. Chickos

Quantity Value Units Method Reference Comment
Δsub101.8 ± 1.8kJ/molCRibeiro da Silva, Lima, et al., 2003
Δsub102.6 ± 1.5kJ/molMERibeiro da Silva, Lima, et al., 2003Based on data from 335. - 351. K.

Enthalpy of sublimation

ΔsubH (kJ/mol) Temperature (K) Method Reference Comment
100.3 ± 1.5343.MERibeiro da Silva, Lima, et al., 2003Based on data from 335. - 351. K.

References

Ribeiro da Silva, Lima, et al., 2003
Ribeiro da Silva, Manuel A.V.; Lima, Luis M. Spencer S.; Amaral, Luisa M.P.F.; Ferreira, Ana I.M.C.L.; Gomes, José R.B., Standard molar enthalpies of formation, vapour pressures, and enthalpies of sublimation of 2-chloro-4-nitroaniline and 2-chloro-5-nitroaniline, The Journal of Chemical Thermodynamics, 2003, 35, 8, 1343-1359, https://doi.org/10.1016/S0021-9614(03)00109-5 . [all data]