Phosphorus oxide anion
- Formula: OP-
- Molecular weight: 46.9737
- CAS Registry Number: 12186-90-2

Reaction thermochemistry data

Data compiled by: John E. Bartmess
Individual Reactions
By formula: (OP- • 4294967295P) + P = OP-
Quantity | Value | Units | Method | Reference | Comment |
---|---|---|---|---|---|
ΔrH° | 558.0 ± 3.5 | kJ/mol | N/A | Zittel and Lineberger, 1976 | gas phase |

Ion clustering data

Data compiled by: John E. Bartmess
Clustering reactions
By formula: (OP- • 4294967295P) + P = OP-
Quantity | Value | Units | Method | Reference | Comment |
---|---|---|---|---|---|
ΔrH° | 558.0 ± 3.5 | kJ/mol | N/A | Zittel and Lineberger, 1976 | gas phase |

References

Zittel and Lineberger, 1976
Zittel, P.F.; Lineberger, W.C.,
Laser photoelectron spectrometry of PO-, PH-, and PH2-,
J. Chem. Phys., 1976, 65, 1236. [all data]