S2 anion
- Formula: S2-
- Molecular weight: 64.131
- CAS Registry Number: 12185-15-8

Gas phase thermochemistry data

Data compiled by: John E. Bartmess
Quantity | Value | Units | Method | Reference | Comment |
---|---|---|---|---|---|
ΔfH°gas | -33. ± 22. | kJ/mol | Acid | Moran and Ellison, 1988 | |
ΔfH°gas | <46.0 ± 9.6 | kJ/mol | IMRB | Dillard and Franklin, 1968 | S- + COS -> S2- + CO. Also S2- + COS -> S3- + CO, etc. to n=6 |

Ion clustering data

Data compiled as indicated in comments:
B - John E. Bartmess
M - Michael M. Meot-Ner (Mautner) and Sharon G. Lias
Clustering reactions
S2- = CS4-
By formula: S2- = CS4-
Quantity | Value | Units | Method | Reference | Comment |
---|---|---|---|---|---|
ΔrH° | 79.9 ± 6.3 | kJ/mol | TDAs | Hiraoka, Fujimaki, et al., 1994 | gas phase; B |
By formula: S2- + CS2 = (S2- • CS2)
Quantity | Value | Units | Method | Reference | Comment |
---|---|---|---|---|---|
ΔrH° | 79.9 | kJ/mol | PHPMS | Hiraoka, Fujimaki, et al., 1994, 2 | gas phase; M |
Quantity | Value | Units | Method | Reference | Comment |
ΔrS° | 120. | J/mol*K | PHPMS | Hiraoka, Fujimaki, et al., 1994, 2 | gas phase; M |
By formula: (S2- • CS2) + CS2 = (S2- • 2CS2)
Quantity | Value | Units | Method | Reference | Comment |
---|---|---|---|---|---|
ΔrH° | 26. | kJ/mol | PHPMS | Hiraoka, Fujimaki, et al., 1994, 2 | gas phase; Entropy change calculated or estimated; M |
Quantity | Value | Units | Method | Reference | Comment |
ΔrS° | 84. | J/mol*K | N/A | Hiraoka, Fujimaki, et al., 1994, 2 | gas phase; Entropy change calculated or estimated; M |
By formula: (S2- • 4294967295S) + S = S2-
Quantity | Value | Units | Method | Reference | Comment |
---|---|---|---|---|---|
ΔrH° | 388. ± 22. | kJ/mol | N/A | Moran and Ellison, 1988 | gas phase; B |

References

Moran and Ellison, 1988
Moran, S.; Ellison, G.B.,
Photoelectron Spectroscopy of Sulfur Ions,
J. Phys. Chem., 1988, 92, 7, 1794, https://doi.org/10.1021/j100318a021
. [all data]
Dillard and Franklin, 1968
Dillard, J.G.; Franklin, J.L.,
Ion-Molecule Reactions of Negative Ions. I. Negative Ions of Sulfur,
J. Chem. Phys., 1968, 48, 5, 2349, https://doi.org/10.1063/1.1669435
. [all data]
Hiraoka, Fujimaki, et al., 1994
Hiraoka, K.; Fujimaki, S.; Aruga, K.,
Frontier-controlled Structures of the Gas Phas Clusters A+/-(CS2)n, A+/- = S2+, CS2+, S2-, and CS2-,
J. Phys. Chem. (1994), 1994, 98, 7, 1802-1809, https://doi.org/10.1021/j100058a014
. [all data]
Hiraoka, Fujimaki, et al., 1994, 2
Hiraoka, K.; Fujimaki, S.; Aruga, K.; Yamabe, S.,
Frontier-Controlled Structures of the Gas-Phase A+-(CS2)n Clusters ,A+- = S2+, CS2+, S2-, and CS2-,
J. Phys. Chem., 1994, 98, 7, 1802, https://doi.org/10.1021/j100058a014
. [all data]