Phosphorus dimer
- Formula: P2
- Molecular weight: 61.947524
- IUPAC Standard InChIKey: FOBPTJZYDGNHLR-UHFFFAOYSA-N
- CAS Registry Number: 12185-09-0
- Chemical structure:
View 3d structure (requires JavaScript / HTML 5) - Permanent link for this species. Use this link for bookmarking this species for future reference.

Gas phase thermochemistry data

Quantity | Value | Units | Method | Reference | Comment |
---|---|---|---|---|---|
ΔfH°gas | 144.0 ± 2.0 | kJ/mol | Review | Cox, Wagman, et al., 1984 | CODATA Review value |
ΔfH°gas | 143.65 | kJ/mol | Review | Chase, 1998 | Data last reviewed in June, 1961 |
Quantity | Value | Units | Method | Reference | Comment |
S°gas,1 bar | 218.123 ± 0.004 | J/mol*K | Review | Cox, Wagman, et al., 1984 | CODATA Review value |
S°gas,1 bar | 218.07 | J/mol*K | Review | Chase, 1998 | Data last reviewed in June, 1961 |
Gas Phase Heat Capacity (Shomate Equation)
Cp° = A + B*t + C*t2 + D*t3 +
E/t2
H° − H°298.15= A*t + B*t2/2 +
C*t3/3 + D*t4/4 − E/t + F − H
S° = A*ln(t) + B*t + C*t2/2 + D*t3/3 −
E/(2*t2) + G
Cp = heat capacity (J/mol*K)
H° = standard enthalpy (kJ/mol)
S° = standard entropy (J/mol*K)
t = temperature (K) / 1000.
View plot Requires a JavaScript / HTML 5 canvas capable browser.
Temperature (K) | 298. to 6000. |
---|---|
A | 35.92198 |
B | 1.483806 |
C | -0.339811 |
D | 0.028919 |
E | -0.401919 |
F | 131.5232 |
G | 258.8557 |
H | 143.6530 |
Reference | Chase, 1998 |
Comment | Data last reviewed in June, 1961 |

Reaction thermochemistry data

Data compiled by: John E. Bartmess
Individual Reactions
(CAS Reg. No. 141171-05-3 • 4294967295) +
= CAS Reg. No. 141171-05-3
By formula: (CAS Reg. No. 141171-05-3 • 4294967295P2) + P2 = CAS Reg. No. 141171-05-3
Quantity | Value | Units | Method | Reference | Comment |
---|---|---|---|---|---|
ΔrH° | 208. ± 32. | kJ/mol | Ther | O'Hair, Krempp, et al., 1992 | gas phase; Acidity between MeNO2, tBuSH |
ΔrH° | 213. ± 21. | kJ/mol | IMRB | O'Hair, Krempp, et al., 1992 | gas phase; Hydride affinity: between CO2, SO2 |
(CAS Reg. No. 141171-04-2 • 4294967295) +
= CAS Reg. No. 141171-04-2
By formula: (CAS Reg. No. 141171-04-2 • 4294967295P2) + P2 = CAS Reg. No. 141171-04-2
Quantity | Value | Units | Method | Reference | Comment |
---|---|---|---|---|---|
ΔrH° | 144. ± 10. | kJ/mol | IMRB | O'Hair, Krempp, et al., 1992 | gas phase; Fluoride affinity: Between H2S, MeSH |
ΔrH° | 138. ± 34. | kJ/mol | Ther | O'Hair, Krempp, et al., 1992 | gas phase; Acidity between MeSH, H2S |

Gas phase ion energetics data

Data evaluated as indicated in comments:
L - Sharon G. Lias
Data compiled as indicated in comments:
LLK - Sharon G. Lias, Rhoda D. Levin, and Sherif A. Kafafi
RDSH - Henry M. Rosenstock, Keith Draxl, Bruce W. Steiner, and John T. Herron
B - John E. Bartmess
Quantity | Value | Units | Method | Reference | Comment |
---|---|---|---|---|---|
IE (evaluated) | 10.53 | eV | N/A | N/A | L |
Electron affinity determinations
EA (eV) | Method | Reference | Comment |
---|---|---|---|
0.630 ± 0.050 | LPES | Jones, Ganteför, et al., 1995 | Vertical Detachment Energy: 0.68±0.05 eV; B |
0.589 ± 0.025 | LPES | Snodgrass, Coe, et al., 1985 | B |
<0.649985 | PD | Feldman, Rackwitz, et al., 1977 | B |
0.24 ± 0.23 | EIAE | Bennett, Margrave, et al., 1974 | From P4; B |
Ionization energy determinations
IE (eV) | Method | Reference | Comment |
---|---|---|---|
11.7 ± 0.5 | EI | Balducci, Gigli, et al., 1981 | LLK |
10.53 | EVAL | Huber and Herzberg, 1979 | LLK |
10.567 ± 0.002 | S | Carroll and Mitchell, 1975 | LLK |
10.3 ± 0.5 | EI | Gingerich, Cocke, et al., 1974 | LLK |
9.7 | EI | Drowart, Myers, et al., 1973 | LLK |
10.60 | PE | Potts, Glenn, et al., 1972 | LLK |
9.7 ± 0.5 | EI | Smoes, Myers, et al., 1971 | LLK |
11.2 | EI | Gingerich and Piacente, 1971 | LLK |
10.7 ± 0.1 | S | Donovan and Strachan, 1971 | LLK |
11.0 ± 0.3 | EI | DeMaria, Gingerich, et al., 1968 | RDSH |
9.6 ± 0.3 | EI | Carlson, Kohl, et al., 1968 | RDSH |
11.8 ± 0.5 | EI | Gutbier, 1961 | RDSH |
10.62 ± 0.01 | PE | Bulgin, Dyke, et al., 1976 | Vertical value; LLK |
10.84 | PE | Potts, Glenn, et al., 1972 | Vertical value; LLK |
Appearance energy determinations
Ion | AE (eV) | Other Products | Method | Reference | Comment |
---|---|---|---|---|---|
P+ | 15.9 | P | EI | Gingerich and Piacente, 1971 | LLK |
P+ | 15.1 ± 0.3 | P | EI | DeMaria, Gingerich, et al., 1968 | RDSH |

References

Cox, Wagman, et al., 1984
Cox, J.D.; Wagman, D.D.; Medvedev, V.A.,
CODATA Key Values for Thermodynamics, Hemisphere Publishing Corp., New York, 1984, 1. [all data]
Chase, 1998
Chase, M.W., Jr.,
NIST-JANAF Themochemical Tables, Fourth Edition,
J. Phys. Chem. Ref. Data, Monograph 9, 1998, 1-1951. [all data]
O'Hair, Krempp, et al., 1992
O'Hair, R.A.J.; Krempp, M.; Damrauer, R.; Depuy, C.H.,
Gas-Phase Ion Chemistry of HP2(-), FP2(-), and HP2(+),
Inorg. Chem., 1992, 31, 11, 2092, https://doi.org/10.1021/ic00037a021
. [all data]