Oxygen cation
- Formula: O2+
- Molecular weight: 31.9983
- IUPAC Standard InChIKey: KMHJKRGRIJONSV-UHFFFAOYSA-N
- CAS Registry Number: 12185-07-8
- Chemical structure:
View 3d structure (requires JavaScript / HTML 5) - Permanent link for this species. Use this link for bookmarking this species for future reference.

Gas phase thermochemistry data

Quantity | Value | Units | Method | Reference | Comment |
---|---|---|---|---|---|
S°gas,1 bar | 206.22 | J/mol*K | Review | Chase, 1998 | Data last reviewed in September, 1977 |

Reaction thermochemistry data

Data compiled by: Michael M. Meot-Ner (Mautner) and Sharon G. Lias
Individual Reactions
By formula: O2+ + CO2 = (O2+ • CO2)
Quantity | Value | Units | Method | Reference | Comment |
---|---|---|---|---|---|
ΔrH° | 41. ± 4. | kJ/mol | AVG | N/A | Average of 4 out of 6 values; Individual data points |
Quantity | Value | Units | Method | Reference | Comment |
ΔrS° | 73.2 | J/mol*K | PHPMS | Hiraoka, Nakajima, et al., 1988 | gas phase |
ΔrS° | 79.1 | J/mol*K | DT | Illies, 1988 | gas phase; ΔrH(0 K)=41.0 kJ/mol |
ΔrS° | 86.6 | J/mol*K | N/A | Dotan, Davidson, et al., 1978 | gas phase; switching reaction(O2+)O2, Entropy change calculated or estimated; Conway and Janik, 1970 |
ΔrS° | 84. | J/mol*K | N/A | Meot-Ner (Mautner) and Field, 1977 | gas phase; Entropy change calculated or estimated, DG>, ΔrH> |
Quantity | Value | Units | Method | Reference | Comment |
ΔrG° | 18. | kJ/mol | DT | Rakshit and Warneck, 1981 | gas phase |
ΔrG° | 18. | kJ/mol | FA | Dotan, Davidson, et al., 1978 | gas phase; switching reaction(O2+)O2, Entropy change calculated or estimated; Conway and Janik, 1970 |
Free energy of reaction
ΔrG° (kJ/mol) | T (K) | Method | Reference | Comment |
---|---|---|---|---|
39. | 600. | PHPMS | Meot-Ner (Mautner) and Field, 1977 | gas phase; Entropy change calculated or estimated, DG>, ΔrH> |
By formula: O2+ + O2 = (O2+ • O2)
Quantity | Value | Units | Method | Reference | Comment |
---|---|---|---|---|---|
ΔrH° | 41. ± 5. | kJ/mol | AVG | N/A | Average of 5 out of 6 values; Individual data points |
Quantity | Value | Units | Method | Reference | Comment |
ΔrS° | 78.7 | J/mol*K | PHPMS | Hiraoka, 1988 | gas phase |
ΔrS° | 104.7 | J/mol*K | PHPMS | Conway and Janik, 1970 | gas phase |
ΔrS° | 84. | J/mol*K | PHPMS | Durden, Kebarle, et al., 1969 | gas phase |
ΔrS° | 86.2 | J/mol*K | PHPMS | Yang and Conway, 1964 | gas phase |
Free energy of reaction
ΔrG° (kJ/mol) | T (K) | Method | Reference | Comment |
---|---|---|---|---|
16. | 300. | DT | Rakshit and Warneck, 1981 | gas phase |
14. | 300. | DT | Rakshit and Warneck, 1980 | gas phase |
14. | 296. | FA | Howard, Bierbaum, et al., 1972 | gas phase |
25. | 200. | FA | Adams and Bohme, 1970 | gas phase |
By formula: O2+ + N2 = (O2+ • N2)
Quantity | Value | Units | Method | Reference | Comment |
---|---|---|---|---|---|
ΔrH° | 21. ± 1. | kJ/mol | PHPMS | Hiraoka and Nakajima, 1988 | gas phase |
ΔrH° | 22. | kJ/mol | HPMS | Speller and Fitaire, 1983 | gas phase |
ΔrH° | 24. | kJ/mol | PHPMS | Janik and Conway, 1967 | gas phase |
Quantity | Value | Units | Method | Reference | Comment |
ΔrS° | 72.8 | J/mol*K | PHPMS | Hiraoka and Nakajima, 1988 | gas phase |
ΔrS° | 66.1 | J/mol*K | HPMS | Speller and Fitaire, 1983 | gas phase |
ΔrS° | 79.1 | J/mol*K | PHPMS | Janik and Conway, 1967 | gas phase |
Free energy of reaction
ΔrG° (kJ/mol) | T (K) | Method | Reference | Comment |
---|---|---|---|---|
0.0 | 296. | FA | Howard, Bierbaum, et al., 1972 | gas phase |
By formula: O2+ + O3 = (O2+ • O3)
Quantity | Value | Units | Method | Reference | Comment |
---|---|---|---|---|---|
ΔrH° | 60.7 | kJ/mol | FA | Dotan, Davidson, et al., 1978 | gas phase; switching reaction(O2+)O2, Entropy change calculated or estimated; Conway and Janik, 1970 |
Quantity | Value | Units | Method | Reference | Comment |
ΔrS° | 85.8 | J/mol*K | N/A | Dotan, Davidson, et al., 1978 | gas phase; switching reaction(O2+)O2, Entropy change calculated or estimated; Conway and Janik, 1970 |
Quantity | Value | Units | Method | Reference | Comment |
ΔrG° | 35. | kJ/mol | FA | Dotan, Davidson, et al., 1978 | gas phase; switching reaction(O2+)O2, Entropy change calculated or estimated; Conway and Janik, 1970 |
By formula: O2+ + N2O = (O2+ • N2O)
Quantity | Value | Units | Method | Reference | Comment |
---|---|---|---|---|---|
ΔrH° | 56.1 | kJ/mol | PHPMS | Hiraoka, Fujimaki, et al., 1994 | gas phase |
ΔrH° | 45. ± 2. | kJ/mol | DT | Illies, 1988 | gas phase; ΔrH(0 K)=45.2 kJ/mol |
Quantity | Value | Units | Method | Reference | Comment |
ΔrS° | 96. | J/mol*K | PHPMS | Hiraoka, Fujimaki, et al., 1994 | gas phase |
ΔrS° | 64.0 | J/mol*K | DT | Illies, 1988 | gas phase; ΔrH(0 K)=45.2 kJ/mol |
Free energy of reaction
ΔrG° (kJ/mol) | T (K) | Method | Reference | Comment |
---|---|---|---|---|
37. | 200. | FA | Adams and Bohme, 1970 | gas phase; switching reaction(O2+)O2 |
By formula: (O2+ • CO2) + CO2 = (O2+ • 2CO2)
Quantity | Value | Units | Method | Reference | Comment |
---|---|---|---|---|---|
ΔrH° | 36. ± 2. | kJ/mol | PHPMS | Hiraoka, Nakajima, et al., 1988 | gas phase |
ΔrH° | 31. | kJ/mol | PHPMS | Meot-Ner (Mautner) and Field, 1977 | gas phase; Entropy change is questionable |
Quantity | Value | Units | Method | Reference | Comment |
ΔrS° | 78.2 | J/mol*K | PHPMS | Hiraoka, Nakajima, et al., 1988 | gas phase |
ΔrS° | 63. | J/mol*K | PHPMS | Meot-Ner (Mautner) and Field, 1977 | gas phase; Entropy change is questionable |
By formula: (O2+ • 2N2) + N2 = (O2+ • 3N2)
Quantity | Value | Units | Method | Reference | Comment |
---|---|---|---|---|---|
ΔrH° | 18. ± 1. | kJ/mol | PHPMS | Hiraoka and Nakajima, 1988 | gas phase |
ΔrH° | 15. | kJ/mol | HPMS | Speller and Fitaire, 1983 | gas phase; Entropy change is questionable |
Quantity | Value | Units | Method | Reference | Comment |
ΔrS° | 82.0 | J/mol*K | PHPMS | Hiraoka and Nakajima, 1988 | gas phase |
ΔrS° | 50.6 | J/mol*K | HPMS | Speller and Fitaire, 1983 | gas phase; Entropy change is questionable |
By formula: (O2+ • N2) + N2 = (O2+ • 2N2)
Quantity | Value | Units | Method | Reference | Comment |
---|---|---|---|---|---|
ΔrH° | 19. ± 1. | kJ/mol | PHPMS | Hiraoka and Nakajima, 1988 | gas phase |
ΔrH° | 18. | kJ/mol | HPMS | Speller and Fitaire, 1983 | gas phase; Entropy change is questionable |
Quantity | Value | Units | Method | Reference | Comment |
ΔrS° | 79.9 | J/mol*K | PHPMS | Hiraoka and Nakajima, 1988 | gas phase |
ΔrS° | 57.7 | J/mol*K | HPMS | Speller and Fitaire, 1983 | gas phase; Entropy change is questionable |
By formula: (O2+ • O2) + O2 = (O2+ • 2O2)
Quantity | Value | Units | Method | Reference | Comment |
---|---|---|---|---|---|
ΔrH° | 25. ± 1. | kJ/mol | PHPMS | Hiraoka, 1988 | gas phase |
ΔrH° | 28.7 ± 0.3 | kJ/mol | PHPMS | Conway and Janik, 1970 | gas phase |
Quantity | Value | Units | Method | Reference | Comment |
ΔrS° | 110. | J/mol*K | PHPMS | Hiraoka, 1988 | gas phase |
ΔrS° | 133.0 | J/mol*K | PHPMS | Conway and Janik, 1970 | gas phase |
By formula: (O2+ • 3O2) + O2 = (O2+ • 4O2)
Quantity | Value | Units | Method | Reference | Comment |
---|---|---|---|---|---|
ΔrH° | 9.0 ± 0.8 | kJ/mol | PHPMS | Hiraoka, 1988 | gas phase |
ΔrH° | 10.3 ± 0.75 | kJ/mol | PHPMS | Conway and Janik, 1970 | gas phase |
Quantity | Value | Units | Method | Reference | Comment |
ΔrS° | 88.7 | J/mol*K | PHPMS | Hiraoka, 1988 | gas phase |
ΔrS° | 100. | J/mol*K | PHPMS | Conway and Janik, 1970 | gas phase |
By formula: (O2+ • 2O2) + O2 = (O2+ • 3O2)
Quantity | Value | Units | Method | Reference | Comment |
---|---|---|---|---|---|
ΔrH° | 10.4 ± 0.8 | kJ/mol | PHPMS | Hiraoka, 1988 | gas phase |
ΔrH° | 10.6 ± 0.4 | kJ/mol | PHPMS | Conway and Janik, 1970 | gas phase |
Quantity | Value | Units | Method | Reference | Comment |
ΔrS° | 78.2 | J/mol*K | PHPMS | Hiraoka, 1988 | gas phase |
ΔrS° | 82.8 | J/mol*K | PHPMS | Conway and Janik, 1970 | gas phase |
By formula: (O2+ • 4O2) + O2 = (O2+ • 5O2)
Quantity | Value | Units | Method | Reference | Comment |
---|---|---|---|---|---|
ΔrH° | 8.0 ± 0.8 | kJ/mol | PHPMS | Hiraoka, 1988 | gas phase |
ΔrH° | 8. ± 3. | kJ/mol | PHPMS | Conway and Janik, 1970 | gas phase |
Quantity | Value | Units | Method | Reference | Comment |
ΔrS° | 89.5 | J/mol*K | PHPMS | Hiraoka, 1988 | gas phase |
ΔrS° | 71.1 | J/mol*K | PHPMS | Conway and Janik, 1970 | gas phase |
By formula: (O2+ • 4N2) + N2 = (O2+ • 5N2)
Quantity | Value | Units | Method | Reference | Comment |
---|---|---|---|---|---|
ΔrH° | 11.3 ± 0.8 | kJ/mol | PHPMS | Hiraoka and Nakajima, 1988 | gas phase |
Quantity | Value | Units | Method | Reference | Comment |
ΔrS° | 67.8 | J/mol*K | PHPMS | Hiraoka and Nakajima, 1988 | gas phase |
Free energy of reaction
ΔrG° (kJ/mol) | T (K) | Method | Reference | Comment |
---|---|---|---|---|
3. | 184. | HPMS | Speller and Fitaire, 1983 | gas phase |
By formula: (O2+ • 3N2) + N2 = (O2+ • 4N2)
Quantity | Value | Units | Method | Reference | Comment |
---|---|---|---|---|---|
ΔrH° | 17. ± 1. | kJ/mol | PHPMS | Hiraoka and Nakajima, 1988 | gas phase |
Quantity | Value | Units | Method | Reference | Comment |
ΔrS° | 94.1 | J/mol*K | PHPMS | Hiraoka and Nakajima, 1988 | gas phase |
Free energy of reaction
ΔrG° (kJ/mol) | T (K) | Method | Reference | Comment |
---|---|---|---|---|
3. | 204. | HPMS | Speller and Fitaire, 1983 | gas phase |
By formula: (O2+ • 5CO2) + CO2 = (O2+ • 6CO2)
Quantity | Value | Units | Method | Reference | Comment |
---|---|---|---|---|---|
ΔrH° | 17. | kJ/mol | PHPMS | Hiraoka, Nakajima, et al., 1988 | gas phase; Entropy change calculated or estimated |
Quantity | Value | Units | Method | Reference | Comment |
ΔrS° | 84. | J/mol*K | N/A | Hiraoka, Nakajima, et al., 1988 | gas phase; Entropy change calculated or estimated |
By formula: (O2+ • 7O2) + O2 = (O2+ • 8O2)
Quantity | Value | Units | Method | Reference | Comment |
---|---|---|---|---|---|
ΔrH° | 7.61 | kJ/mol | PHPMS | Hiraoka, 1988 | gas phase; Entropy change calculated or estimated |
Quantity | Value | Units | Method | Reference | Comment |
ΔrS° | 92. | J/mol*K | N/A | Hiraoka, 1988 | gas phase; Entropy change calculated or estimated |
By formula: (O2+ • O2) + N2 = (O2+ • N2 • O2)
Quantity | Value | Units | Method | Reference | Comment |
---|---|---|---|---|---|
ΔrH° | 12. | kJ/mol | HPMS | Speller and Fitaire, 1983 | gas phase; Entropy change is questionable |
Quantity | Value | Units | Method | Reference | Comment |
ΔrS° | 42.3 | J/mol*K | HPMS | Speller and Fitaire, 1983 | gas phase; Entropy change is questionable |
By formula: (O2+ • 10N2) + N2 = (O2+ • 11N2)
Quantity | Value | Units | Method | Reference | Comment |
---|---|---|---|---|---|
ΔrH° | 6. ± 1. | kJ/mol | PHPMS | Hiraoka and Nakajima, 1988 | gas phase |
Quantity | Value | Units | Method | Reference | Comment |
ΔrS° | 84.5 | J/mol*K | PHPMS | Hiraoka and Nakajima, 1988 | gas phase |
By formula: (O2+ • 9N2) + N2 = (O2+ • 10N2)
Quantity | Value | Units | Method | Reference | Comment |
---|---|---|---|---|---|
ΔrH° | 7.0 ± 0.8 | kJ/mol | PHPMS | Hiraoka and Nakajima, 1988 | gas phase |
Quantity | Value | Units | Method | Reference | Comment |
ΔrS° | 87.0 | J/mol*K | PHPMS | Hiraoka and Nakajima, 1988 | gas phase |
By formula: (O2+ • 5N2) + N2 = (O2+ • 6N2)
Quantity | Value | Units | Method | Reference | Comment |
---|---|---|---|---|---|
ΔrH° | 10.3 ± 0.8 | kJ/mol | PHPMS | Hiraoka and Nakajima, 1988 | gas phase |
Quantity | Value | Units | Method | Reference | Comment |
ΔrS° | 67.4 | J/mol*K | PHPMS | Hiraoka and Nakajima, 1988 | gas phase |
By formula: (O2+ • 6N2) + N2 = (O2+ • 7N2)
Quantity | Value | Units | Method | Reference | Comment |
---|---|---|---|---|---|
ΔrH° | 9.5 ± 0.8 | kJ/mol | PHPMS | Hiraoka and Nakajima, 1988 | gas phase |
Quantity | Value | Units | Method | Reference | Comment |
ΔrS° | 77.4 | J/mol*K | PHPMS | Hiraoka and Nakajima, 1988 | gas phase |
By formula: (O2+ • 7N2) + N2 = (O2+ • 8N2)
Quantity | Value | Units | Method | Reference | Comment |
---|---|---|---|---|---|
ΔrH° | 8.8 ± 0.8 | kJ/mol | PHPMS | Hiraoka and Nakajima, 1988 | gas phase |
Quantity | Value | Units | Method | Reference | Comment |
ΔrS° | 80.8 | J/mol*K | PHPMS | Hiraoka and Nakajima, 1988 | gas phase |
By formula: (O2+ • 8N2) + N2 = (O2+ • 9N2)
Quantity | Value | Units | Method | Reference | Comment |
---|---|---|---|---|---|
ΔrH° | 7.9 ± 0.8 | kJ/mol | PHPMS | Hiraoka and Nakajima, 1988 | gas phase |
Quantity | Value | Units | Method | Reference | Comment |
ΔrS° | 79.9 | J/mol*K | PHPMS | Hiraoka and Nakajima, 1988 | gas phase |
By formula: (O2+ • 2N2O) + N2O = (O2+ • 3N2O)
Quantity | Value | Units | Method | Reference | Comment |
---|---|---|---|---|---|
ΔrH° | 25. | kJ/mol | PHPMS | Hiraoka, Fujimaki, et al., 1994 | gas phase |
Quantity | Value | Units | Method | Reference | Comment |
ΔrS° | 79. | J/mol*K | PHPMS | Hiraoka, Fujimaki, et al., 1994 | gas phase |
By formula: (O2+ • 2CO2) + CO2 = (O2+ • 3CO2)
Quantity | Value | Units | Method | Reference | Comment |
---|---|---|---|---|---|
ΔrH° | 26. ± 1. | kJ/mol | PHPMS | Hiraoka, Nakajima, et al., 1988 | gas phase |
Quantity | Value | Units | Method | Reference | Comment |
ΔrS° | 82.8 | J/mol*K | PHPMS | Hiraoka, Nakajima, et al., 1988 | gas phase |
By formula: (O2+ • 3N2O) + N2O = (O2+ • 4N2O)
Quantity | Value | Units | Method | Reference | Comment |
---|---|---|---|---|---|
ΔrH° | 22. | kJ/mol | PHPMS | Hiraoka, Fujimaki, et al., 1994 | gas phase |
Quantity | Value | Units | Method | Reference | Comment |
ΔrS° | 92. | J/mol*K | PHPMS | Hiraoka, Fujimaki, et al., 1994 | gas phase |
By formula: (O2+ • 3CO2) + CO2 = (O2+ • 4CO2)
Quantity | Value | Units | Method | Reference | Comment |
---|---|---|---|---|---|
ΔrH° | 21. ± 1. | kJ/mol | PHPMS | Hiraoka, Nakajima, et al., 1988 | gas phase |
Quantity | Value | Units | Method | Reference | Comment |
ΔrS° | 82.0 | J/mol*K | PHPMS | Hiraoka, Nakajima, et al., 1988 | gas phase |
By formula: (O2+ • 4N2O) + N2O = (O2+ • 5N2O)
Quantity | Value | Units | Method | Reference | Comment |
---|---|---|---|---|---|
ΔrH° | 20. | kJ/mol | PHPMS | Hiraoka, Fujimaki, et al., 1994 | gas phase |
Quantity | Value | Units | Method | Reference | Comment |
ΔrS° | 96. | J/mol*K | PHPMS | Hiraoka, Fujimaki, et al., 1994 | gas phase |
By formula: (O2+ • 4CO2) + CO2 = (O2+ • 5CO2)
Quantity | Value | Units | Method | Reference | Comment |
---|---|---|---|---|---|
ΔrH° | 19. ± 2. | kJ/mol | PHPMS | Hiraoka, Nakajima, et al., 1988 | gas phase |
Quantity | Value | Units | Method | Reference | Comment |
ΔrS° | 83.7 | J/mol*K | PHPMS | Hiraoka, Nakajima, et al., 1988 | gas phase |
By formula: (O2+ • 5N2O) + N2O = (O2+ • 6N2O)
Quantity | Value | Units | Method | Reference | Comment |
---|---|---|---|---|---|
ΔrH° | 18. | kJ/mol | PHPMS | Hiraoka, Fujimaki, et al., 1994 | gas phase |
Quantity | Value | Units | Method | Reference | Comment |
ΔrS° | 92. | J/mol*K | PHPMS | Hiraoka, Fujimaki, et al., 1994 | gas phase |
By formula: (O2+ • 6N2O) + N2O = (O2+ • 7N2O)
Quantity | Value | Units | Method | Reference | Comment |
---|---|---|---|---|---|
ΔrH° | 16. | kJ/mol | PHPMS | Hiraoka, Fujimaki, et al., 1994 | gas phase |
Quantity | Value | Units | Method | Reference | Comment |
ΔrS° | 84. | J/mol*K | PHPMS | Hiraoka, Fujimaki, et al., 1994 | gas phase |
By formula: (O2+ • N2O) + N2O = (O2+ • 2N2O)
Quantity | Value | Units | Method | Reference | Comment |
---|---|---|---|---|---|
ΔrH° | 31. | kJ/mol | PHPMS | Hiraoka, Fujimaki, et al., 1994 | gas phase |
Quantity | Value | Units | Method | Reference | Comment |
ΔrS° | 84. | J/mol*K | PHPMS | Hiraoka, Fujimaki, et al., 1994 | gas phase |
By formula: (O2+ • 5O2) + O2 = (O2+ • 6O2)
Quantity | Value | Units | Method | Reference | Comment |
---|---|---|---|---|---|
ΔrH° | 8. ± 1. | kJ/mol | PHPMS | Hiraoka, 1988 | gas phase |
Quantity | Value | Units | Method | Reference | Comment |
ΔrS° | 90.8 | J/mol*K | PHPMS | Hiraoka, 1988 | gas phase |
By formula: (O2+ • 6O2) + O2 = (O2+ • 7O2)
Quantity | Value | Units | Method | Reference | Comment |
---|---|---|---|---|---|
ΔrH° | 8. ± 2. | kJ/mol | PHPMS | Hiraoka, 1988 | gas phase |
Quantity | Value | Units | Method | Reference | Comment |
ΔrS° | 91.6 | J/mol*K | PHPMS | Hiraoka, 1988 | gas phase |
By formula: O2+ + O2S = (O2+ • O2S)
Quantity | Value | Units | Method | Reference | Comment |
---|---|---|---|---|---|
ΔrG° | 40. | kJ/mol | FA | Adams and Bohme, 1970 | gas phase; switching reaction(O2+)O2; Conway and Janik, 1970 |
By formula: O2+ + H2O = (O2+ • H2O)
Quantity | Value | Units | Method | Reference | Comment |
---|---|---|---|---|---|
ΔrH° | 67. | kJ/mol | FA | Adams and Bohme, 1970 | gas phase; switching reaction(O2+)SO2, ΔrH> |
By formula: (O2+ • N2 • O2) + N2 = (O2+ • 2N2 • O2)
Free energy of reaction
ΔrG° (kJ/mol) | T (K) | Method | Reference | Comment |
---|---|---|---|---|
2. | 230. | HPMS | Speller and Fitaire, 1983 | gas phase |
By formula: O2+ + Kr = (O2+ • Kr)
Quantity | Value | Units | Method | Reference | Comment |
---|---|---|---|---|---|
ΔrH° | 32. | kJ/mol | PDiss | Jarrold, Misev, et al., 1984 | gas phase |

Ion clustering data

Data compiled by: Michael M. Meot-Ner (Mautner) and Sharon G. Lias
Clustering reactions
By formula: O2+ + CO2 = (O2+ • CO2)
Quantity | Value | Units | Method | Reference | Comment |
---|---|---|---|---|---|
ΔrH° | 41. ± 4. | kJ/mol | AVG | N/A | Average of 4 out of 6 values; Individual data points |
Quantity | Value | Units | Method | Reference | Comment |
ΔrS° | 73.2 | J/mol*K | PHPMS | Hiraoka, Nakajima, et al., 1988 | gas phase |
ΔrS° | 79.1 | J/mol*K | DT | Illies, 1988 | gas phase; ΔrH(0 K)=41.0 kJ/mol |
ΔrS° | 86.6 | J/mol*K | N/A | Dotan, Davidson, et al., 1978 | gas phase; switching reaction(O2+)O2, Entropy change calculated or estimated; Conway and Janik, 1970 |
ΔrS° | 84. | J/mol*K | N/A | Meot-Ner (Mautner) and Field, 1977 | gas phase; Entropy change calculated or estimated, DG>, ΔrH> |
Quantity | Value | Units | Method | Reference | Comment |
ΔrG° | 18. | kJ/mol | DT | Rakshit and Warneck, 1981 | gas phase |
ΔrG° | 18. | kJ/mol | FA | Dotan, Davidson, et al., 1978 | gas phase; switching reaction(O2+)O2, Entropy change calculated or estimated; Conway and Janik, 1970 |
Free energy of reaction
ΔrG° (kJ/mol) | T (K) | Method | Reference | Comment |
---|---|---|---|---|
39. | 600. | PHPMS | Meot-Ner (Mautner) and Field, 1977 | gas phase; Entropy change calculated or estimated, DG>, ΔrH> |
By formula: (O2+ • CO2) + CO2 = (O2+ • 2CO2)
Quantity | Value | Units | Method | Reference | Comment |
---|---|---|---|---|---|
ΔrH° | 36. ± 2. | kJ/mol | PHPMS | Hiraoka, Nakajima, et al., 1988 | gas phase |
ΔrH° | 31. | kJ/mol | PHPMS | Meot-Ner (Mautner) and Field, 1977 | gas phase; Entropy change is questionable |
Quantity | Value | Units | Method | Reference | Comment |
ΔrS° | 78.2 | J/mol*K | PHPMS | Hiraoka, Nakajima, et al., 1988 | gas phase |
ΔrS° | 63. | J/mol*K | PHPMS | Meot-Ner (Mautner) and Field, 1977 | gas phase; Entropy change is questionable |
By formula: (O2+ • 2CO2) + CO2 = (O2+ • 3CO2)
Quantity | Value | Units | Method | Reference | Comment |
---|---|---|---|---|---|
ΔrH° | 26. ± 1. | kJ/mol | PHPMS | Hiraoka, Nakajima, et al., 1988 | gas phase |
Quantity | Value | Units | Method | Reference | Comment |
ΔrS° | 82.8 | J/mol*K | PHPMS | Hiraoka, Nakajima, et al., 1988 | gas phase |
By formula: (O2+ • 3CO2) + CO2 = (O2+ • 4CO2)
Quantity | Value | Units | Method | Reference | Comment |
---|---|---|---|---|---|
ΔrH° | 21. ± 1. | kJ/mol | PHPMS | Hiraoka, Nakajima, et al., 1988 | gas phase |
Quantity | Value | Units | Method | Reference | Comment |
ΔrS° | 82.0 | J/mol*K | PHPMS | Hiraoka, Nakajima, et al., 1988 | gas phase |
By formula: (O2+ • 4CO2) + CO2 = (O2+ • 5CO2)
Quantity | Value | Units | Method | Reference | Comment |
---|---|---|---|---|---|
ΔrH° | 19. ± 2. | kJ/mol | PHPMS | Hiraoka, Nakajima, et al., 1988 | gas phase |
Quantity | Value | Units | Method | Reference | Comment |
ΔrS° | 83.7 | J/mol*K | PHPMS | Hiraoka, Nakajima, et al., 1988 | gas phase |
By formula: (O2+ • 5CO2) + CO2 = (O2+ • 6CO2)
Quantity | Value | Units | Method | Reference | Comment |
---|---|---|---|---|---|
ΔrH° | 17. | kJ/mol | PHPMS | Hiraoka, Nakajima, et al., 1988 | gas phase; Entropy change calculated or estimated |
Quantity | Value | Units | Method | Reference | Comment |
ΔrS° | 84. | J/mol*K | N/A | Hiraoka, Nakajima, et al., 1988 | gas phase; Entropy change calculated or estimated |
By formula: O2+ + H2O = (O2+ • H2O)
Quantity | Value | Units | Method | Reference | Comment |
---|---|---|---|---|---|
ΔrH° | 67. | kJ/mol | FA | Adams and Bohme, 1970 | gas phase; switching reaction(O2+)SO2, ΔrH> |
By formula: O2+ + Kr = (O2+ • Kr)
Quantity | Value | Units | Method | Reference | Comment |
---|---|---|---|---|---|
ΔrH° | 32. | kJ/mol | PDiss | Jarrold, Misev, et al., 1984 | gas phase |
By formula: O2+ + N2O = (O2+ • N2O)
Quantity | Value | Units | Method | Reference | Comment |
---|---|---|---|---|---|
ΔrH° | 56.1 | kJ/mol | PHPMS | Hiraoka, Fujimaki, et al., 1994 | gas phase |
ΔrH° | 45. ± 2. | kJ/mol | DT | Illies, 1988 | gas phase; ΔrH(0 K)=45.2 kJ/mol |
Quantity | Value | Units | Method | Reference | Comment |
ΔrS° | 96. | J/mol*K | PHPMS | Hiraoka, Fujimaki, et al., 1994 | gas phase |
ΔrS° | 64.0 | J/mol*K | DT | Illies, 1988 | gas phase; ΔrH(0 K)=45.2 kJ/mol |
Free energy of reaction
ΔrG° (kJ/mol) | T (K) | Method | Reference | Comment |
---|---|---|---|---|
37. | 200. | FA | Adams and Bohme, 1970 | gas phase; switching reaction(O2+)O2 |
By formula: (O2+ • N2O) + N2O = (O2+ • 2N2O)
Quantity | Value | Units | Method | Reference | Comment |
---|---|---|---|---|---|
ΔrH° | 31. | kJ/mol | PHPMS | Hiraoka, Fujimaki, et al., 1994 | gas phase |
Quantity | Value | Units | Method | Reference | Comment |
ΔrS° | 84. | J/mol*K | PHPMS | Hiraoka, Fujimaki, et al., 1994 | gas phase |
By formula: (O2+ • 2N2O) + N2O = (O2+ • 3N2O)
Quantity | Value | Units | Method | Reference | Comment |
---|---|---|---|---|---|
ΔrH° | 25. | kJ/mol | PHPMS | Hiraoka, Fujimaki, et al., 1994 | gas phase |
Quantity | Value | Units | Method | Reference | Comment |
ΔrS° | 79. | J/mol*K | PHPMS | Hiraoka, Fujimaki, et al., 1994 | gas phase |
By formula: (O2+ • 3N2O) + N2O = (O2+ • 4N2O)
Quantity | Value | Units | Method | Reference | Comment |
---|---|---|---|---|---|
ΔrH° | 22. | kJ/mol | PHPMS | Hiraoka, Fujimaki, et al., 1994 | gas phase |
Quantity | Value | Units | Method | Reference | Comment |
ΔrS° | 92. | J/mol*K | PHPMS | Hiraoka, Fujimaki, et al., 1994 | gas phase |
By formula: (O2+ • 4N2O) + N2O = (O2+ • 5N2O)
Quantity | Value | Units | Method | Reference | Comment |
---|---|---|---|---|---|
ΔrH° | 20. | kJ/mol | PHPMS | Hiraoka, Fujimaki, et al., 1994 | gas phase |
Quantity | Value | Units | Method | Reference | Comment |
ΔrS° | 96. | J/mol*K | PHPMS | Hiraoka, Fujimaki, et al., 1994 | gas phase |
By formula: (O2+ • 5N2O) + N2O = (O2+ • 6N2O)
Quantity | Value | Units | Method | Reference | Comment |
---|---|---|---|---|---|
ΔrH° | 18. | kJ/mol | PHPMS | Hiraoka, Fujimaki, et al., 1994 | gas phase |
Quantity | Value | Units | Method | Reference | Comment |
ΔrS° | 92. | J/mol*K | PHPMS | Hiraoka, Fujimaki, et al., 1994 | gas phase |
By formula: (O2+ • 6N2O) + N2O = (O2+ • 7N2O)
Quantity | Value | Units | Method | Reference | Comment |
---|---|---|---|---|---|
ΔrH° | 16. | kJ/mol | PHPMS | Hiraoka, Fujimaki, et al., 1994 | gas phase |
Quantity | Value | Units | Method | Reference | Comment |
ΔrS° | 84. | J/mol*K | PHPMS | Hiraoka, Fujimaki, et al., 1994 | gas phase |
By formula: O2+ + N2 = (O2+ • N2)
Quantity | Value | Units | Method | Reference | Comment |
---|---|---|---|---|---|
ΔrH° | 21. ± 1. | kJ/mol | PHPMS | Hiraoka and Nakajima, 1988 | gas phase |
ΔrH° | 22. | kJ/mol | HPMS | Speller and Fitaire, 1983 | gas phase |
ΔrH° | 24. | kJ/mol | PHPMS | Janik and Conway, 1967 | gas phase |
Quantity | Value | Units | Method | Reference | Comment |
ΔrS° | 72.8 | J/mol*K | PHPMS | Hiraoka and Nakajima, 1988 | gas phase |
ΔrS° | 66.1 | J/mol*K | HPMS | Speller and Fitaire, 1983 | gas phase |
ΔrS° | 79.1 | J/mol*K | PHPMS | Janik and Conway, 1967 | gas phase |
Free energy of reaction
ΔrG° (kJ/mol) | T (K) | Method | Reference | Comment |
---|---|---|---|---|
0.0 | 296. | FA | Howard, Bierbaum, et al., 1972 | gas phase |
By formula: (O2+ • N2) + N2 = (O2+ • 2N2)
Quantity | Value | Units | Method | Reference | Comment |
---|---|---|---|---|---|
ΔrH° | 19. ± 1. | kJ/mol | PHPMS | Hiraoka and Nakajima, 1988 | gas phase |
ΔrH° | 18. | kJ/mol | HPMS | Speller and Fitaire, 1983 | gas phase; Entropy change is questionable |
Quantity | Value | Units | Method | Reference | Comment |
ΔrS° | 79.9 | J/mol*K | PHPMS | Hiraoka and Nakajima, 1988 | gas phase |
ΔrS° | 57.7 | J/mol*K | HPMS | Speller and Fitaire, 1983 | gas phase; Entropy change is questionable |
By formula: (O2+ • 2N2) + N2 = (O2+ • 3N2)
Quantity | Value | Units | Method | Reference | Comment |
---|---|---|---|---|---|
ΔrH° | 18. ± 1. | kJ/mol | PHPMS | Hiraoka and Nakajima, 1988 | gas phase |
ΔrH° | 15. | kJ/mol | HPMS | Speller and Fitaire, 1983 | gas phase; Entropy change is questionable |
Quantity | Value | Units | Method | Reference | Comment |
ΔrS° | 82.0 | J/mol*K | PHPMS | Hiraoka and Nakajima, 1988 | gas phase |
ΔrS° | 50.6 | J/mol*K | HPMS | Speller and Fitaire, 1983 | gas phase; Entropy change is questionable |
By formula: (O2+ • 3N2) + N2 = (O2+ • 4N2)
Quantity | Value | Units | Method | Reference | Comment |
---|---|---|---|---|---|
ΔrH° | 17. ± 1. | kJ/mol | PHPMS | Hiraoka and Nakajima, 1988 | gas phase |
Quantity | Value | Units | Method | Reference | Comment |
ΔrS° | 94.1 | J/mol*K | PHPMS | Hiraoka and Nakajima, 1988 | gas phase |
Free energy of reaction
ΔrG° (kJ/mol) | T (K) | Method | Reference | Comment |
---|---|---|---|---|
3. | 204. | HPMS | Speller and Fitaire, 1983 | gas phase |
By formula: (O2+ • 4N2) + N2 = (O2+ • 5N2)
Quantity | Value | Units | Method | Reference | Comment |
---|---|---|---|---|---|
ΔrH° | 11.3 ± 0.8 | kJ/mol | PHPMS | Hiraoka and Nakajima, 1988 | gas phase |
Quantity | Value | Units | Method | Reference | Comment |
ΔrS° | 67.8 | J/mol*K | PHPMS | Hiraoka and Nakajima, 1988 | gas phase |
Free energy of reaction
ΔrG° (kJ/mol) | T (K) | Method | Reference | Comment |
---|---|---|---|---|
3. | 184. | HPMS | Speller and Fitaire, 1983 | gas phase |
By formula: (O2+ • 5N2) + N2 = (O2+ • 6N2)
Quantity | Value | Units | Method | Reference | Comment |
---|---|---|---|---|---|
ΔrH° | 10.3 ± 0.8 | kJ/mol | PHPMS | Hiraoka and Nakajima, 1988 | gas phase |
Quantity | Value | Units | Method | Reference | Comment |
ΔrS° | 67.4 | J/mol*K | PHPMS | Hiraoka and Nakajima, 1988 | gas phase |
By formula: (O2+ • 6N2) + N2 = (O2+ • 7N2)
Quantity | Value | Units | Method | Reference | Comment |
---|---|---|---|---|---|
ΔrH° | 9.5 ± 0.8 | kJ/mol | PHPMS | Hiraoka and Nakajima, 1988 | gas phase |
Quantity | Value | Units | Method | Reference | Comment |
ΔrS° | 77.4 | J/mol*K | PHPMS | Hiraoka and Nakajima, 1988 | gas phase |
By formula: (O2+ • 7N2) + N2 = (O2+ • 8N2)
Quantity | Value | Units | Method | Reference | Comment |
---|---|---|---|---|---|
ΔrH° | 8.8 ± 0.8 | kJ/mol | PHPMS | Hiraoka and Nakajima, 1988 | gas phase |
Quantity | Value | Units | Method | Reference | Comment |
ΔrS° | 80.8 | J/mol*K | PHPMS | Hiraoka and Nakajima, 1988 | gas phase |
By formula: (O2+ • 8N2) + N2 = (O2+ • 9N2)
Quantity | Value | Units | Method | Reference | Comment |
---|---|---|---|---|---|
ΔrH° | 7.9 ± 0.8 | kJ/mol | PHPMS | Hiraoka and Nakajima, 1988 | gas phase |
Quantity | Value | Units | Method | Reference | Comment |
ΔrS° | 79.9 | J/mol*K | PHPMS | Hiraoka and Nakajima, 1988 | gas phase |
By formula: (O2+ • 9N2) + N2 = (O2+ • 10N2)
Quantity | Value | Units | Method | Reference | Comment |
---|---|---|---|---|---|
ΔrH° | 7.0 ± 0.8 | kJ/mol | PHPMS | Hiraoka and Nakajima, 1988 | gas phase |
Quantity | Value | Units | Method | Reference | Comment |
ΔrS° | 87.0 | J/mol*K | PHPMS | Hiraoka and Nakajima, 1988 | gas phase |
By formula: (O2+ • 10N2) + N2 = (O2+ • 11N2)
Quantity | Value | Units | Method | Reference | Comment |
---|---|---|---|---|---|
ΔrH° | 6. ± 1. | kJ/mol | PHPMS | Hiraoka and Nakajima, 1988 | gas phase |
Quantity | Value | Units | Method | Reference | Comment |
ΔrS° | 84.5 | J/mol*K | PHPMS | Hiraoka and Nakajima, 1988 | gas phase |
By formula: (O2+ • N2 • O2) + N2 = (O2+ • 2N2 • O2)
Free energy of reaction
ΔrG° (kJ/mol) | T (K) | Method | Reference | Comment |
---|---|---|---|---|
2. | 230. | HPMS | Speller and Fitaire, 1983 | gas phase |
By formula: O2+ + O2S = (O2+ • O2S)
Quantity | Value | Units | Method | Reference | Comment |
---|---|---|---|---|---|
ΔrG° | 40. | kJ/mol | FA | Adams and Bohme, 1970 | gas phase; switching reaction(O2+)O2; Conway and Janik, 1970 |
By formula: O2+ + O2 = (O2+ • O2)
Quantity | Value | Units | Method | Reference | Comment |
---|---|---|---|---|---|
ΔrH° | 41. ± 5. | kJ/mol | AVG | N/A | Average of 5 out of 6 values; Individual data points |
Quantity | Value | Units | Method | Reference | Comment |
ΔrS° | 78.7 | J/mol*K | PHPMS | Hiraoka, 1988 | gas phase |
ΔrS° | 104.7 | J/mol*K | PHPMS | Conway and Janik, 1970 | gas phase |
ΔrS° | 84. | J/mol*K | PHPMS | Durden, Kebarle, et al., 1969 | gas phase |
ΔrS° | 86.2 | J/mol*K | PHPMS | Yang and Conway, 1964 | gas phase |
Free energy of reaction
ΔrG° (kJ/mol) | T (K) | Method | Reference | Comment |
---|---|---|---|---|
16. | 300. | DT | Rakshit and Warneck, 1981 | gas phase |
14. | 300. | DT | Rakshit and Warneck, 1980 | gas phase |
14. | 296. | FA | Howard, Bierbaum, et al., 1972 | gas phase |
25. | 200. | FA | Adams and Bohme, 1970 | gas phase |
By formula: (O2+ • O2) + N2 = (O2+ • N2 • O2)
Quantity | Value | Units | Method | Reference | Comment |
---|---|---|---|---|---|
ΔrH° | 12. | kJ/mol | HPMS | Speller and Fitaire, 1983 | gas phase; Entropy change is questionable |
Quantity | Value | Units | Method | Reference | Comment |
ΔrS° | 42.3 | J/mol*K | HPMS | Speller and Fitaire, 1983 | gas phase; Entropy change is questionable |
By formula: (O2+ • O2) + O2 = (O2+ • 2O2)
Quantity | Value | Units | Method | Reference | Comment |
---|---|---|---|---|---|
ΔrH° | 25. ± 1. | kJ/mol | PHPMS | Hiraoka, 1988 | gas phase |
ΔrH° | 28.7 ± 0.3 | kJ/mol | PHPMS | Conway and Janik, 1970 | gas phase |
Quantity | Value | Units | Method | Reference | Comment |
ΔrS° | 110. | J/mol*K | PHPMS | Hiraoka, 1988 | gas phase |
ΔrS° | 133.0 | J/mol*K | PHPMS | Conway and Janik, 1970 | gas phase |
By formula: (O2+ • 2O2) + O2 = (O2+ • 3O2)
Quantity | Value | Units | Method | Reference | Comment |
---|---|---|---|---|---|
ΔrH° | 10.4 ± 0.8 | kJ/mol | PHPMS | Hiraoka, 1988 | gas phase |
ΔrH° | 10.6 ± 0.4 | kJ/mol | PHPMS | Conway and Janik, 1970 | gas phase |
Quantity | Value | Units | Method | Reference | Comment |
ΔrS° | 78.2 | J/mol*K | PHPMS | Hiraoka, 1988 | gas phase |
ΔrS° | 82.8 | J/mol*K | PHPMS | Conway and Janik, 1970 | gas phase |
By formula: (O2+ • 3O2) + O2 = (O2+ • 4O2)
Quantity | Value | Units | Method | Reference | Comment |
---|---|---|---|---|---|
ΔrH° | 9.0 ± 0.8 | kJ/mol | PHPMS | Hiraoka, 1988 | gas phase |
ΔrH° | 10.3 ± 0.75 | kJ/mol | PHPMS | Conway and Janik, 1970 | gas phase |
Quantity | Value | Units | Method | Reference | Comment |
ΔrS° | 88.7 | J/mol*K | PHPMS | Hiraoka, 1988 | gas phase |
ΔrS° | 100. | J/mol*K | PHPMS | Conway and Janik, 1970 | gas phase |
By formula: (O2+ • 4O2) + O2 = (O2+ • 5O2)
Quantity | Value | Units | Method | Reference | Comment |
---|---|---|---|---|---|
ΔrH° | 8.0 ± 0.8 | kJ/mol | PHPMS | Hiraoka, 1988 | gas phase |
ΔrH° | 8. ± 3. | kJ/mol | PHPMS | Conway and Janik, 1970 | gas phase |
Quantity | Value | Units | Method | Reference | Comment |
ΔrS° | 89.5 | J/mol*K | PHPMS | Hiraoka, 1988 | gas phase |
ΔrS° | 71.1 | J/mol*K | PHPMS | Conway and Janik, 1970 | gas phase |
By formula: (O2+ • 5O2) + O2 = (O2+ • 6O2)
Quantity | Value | Units | Method | Reference | Comment |
---|---|---|---|---|---|
ΔrH° | 8. ± 1. | kJ/mol | PHPMS | Hiraoka, 1988 | gas phase |
Quantity | Value | Units | Method | Reference | Comment |
ΔrS° | 90.8 | J/mol*K | PHPMS | Hiraoka, 1988 | gas phase |
By formula: (O2+ • 6O2) + O2 = (O2+ • 7O2)
Quantity | Value | Units | Method | Reference | Comment |
---|---|---|---|---|---|
ΔrH° | 8. ± 2. | kJ/mol | PHPMS | Hiraoka, 1988 | gas phase |
Quantity | Value | Units | Method | Reference | Comment |
ΔrS° | 91.6 | J/mol*K | PHPMS | Hiraoka, 1988 | gas phase |
By formula: (O2+ • 7O2) + O2 = (O2+ • 8O2)
Quantity | Value | Units | Method | Reference | Comment |
---|---|---|---|---|---|
ΔrH° | 7.61 | kJ/mol | PHPMS | Hiraoka, 1988 | gas phase; Entropy change calculated or estimated |
Quantity | Value | Units | Method | Reference | Comment |
ΔrS° | 92. | J/mol*K | N/A | Hiraoka, 1988 | gas phase; Entropy change calculated or estimated |
By formula: O2+ + O3 = (O2+ • O3)
Quantity | Value | Units | Method | Reference | Comment |
---|---|---|---|---|---|
ΔrH° | 60.7 | kJ/mol | FA | Dotan, Davidson, et al., 1978 | gas phase; switching reaction(O2+)O2, Entropy change calculated or estimated; Conway and Janik, 1970 |
Quantity | Value | Units | Method | Reference | Comment |
ΔrS° | 85.8 | J/mol*K | N/A | Dotan, Davidson, et al., 1978 | gas phase; switching reaction(O2+)O2, Entropy change calculated or estimated; Conway and Janik, 1970 |
Quantity | Value | Units | Method | Reference | Comment |
ΔrG° | 35. | kJ/mol | FA | Dotan, Davidson, et al., 1978 | gas phase; switching reaction(O2+)O2, Entropy change calculated or estimated; Conway and Janik, 1970 |

Constants of diatomic molecules

Data compiled by: Klaus P. Huber and Gerhard H. Herzberg
Data collected through March, 1977
Symbol | Meaning |
---|---|
State | electronic state and / or symmetry symbol |
Te | minimum electronic energy (cm-1) |
ωe | vibrational constant – first term (cm-1) |
ωexe | vibrational constant – second term (cm-1) |
ωeye | vibrational constant – third term (cm-1) |
Be | rotational constant in equilibrium position (cm-1) |
αe | rotational constant – first term (cm-1) |
γe | rotation-vibration interaction constant (cm-1) |
De | centrifugal distortion constant (cm-1) |
βe | rotational constant – first term, centrifugal force (cm-1) |
re | internuclear distance (Å) |
Trans. | observed transition(s) corresponding to electronic state |
ν00 | position of 0-0 band (units noted in table) |
State | Te | ωe | ωexe | ωeye | Be | αe | γe | De | βe | re | Trans. | ν00 |
---|---|---|---|---|---|---|---|---|---|---|---|---|
A detailed review of O2+ and its spectrum may be found in Krupenie, 1972. Predicted electronc states and potential functions Beebe, Thulstrup, et al., 1976; contains references to earlier theoretical work. | ||||||||||||
x2 2Σ- | 532.1 eV 1 | x2 → A | 526.4 eV 2 | |||||||||
↳LaVilla, 1975 | ||||||||||||
(x2 → X) | 531.8 eV 3 | |||||||||||
↳LaVilla, 1975 | ||||||||||||
x1 4Σ- | 531.0 eV 1 | x1 → a | 526.4 eV 2 | |||||||||
↳LaVilla, 1975 | ||||||||||||
Several additional states observed in ESCA studies Siegbahn, Nordling, et al., 1969 and tentatively assigned by Jonathan, Morris, et al., 1974. | ||||||||||||
State | Te | ωe | ωexe | ωeye | Be | αe | γe | De | βe | re | Trans. | ν00 |
(2Σg-) | 29.5 eV 4 | |||||||||||
(4Σg-) | 27.5 eV 4 | |||||||||||
(2Σu-) | 15.8 eV 5 | |||||||||||
c 4Σu- | (100914) | [1545] 6 | [1.561] 7 | [6.7E-6] | [1.1620] | c → b V | 51540.7 Z | |||||
↳LeBlanc, 1963; missing citation | ||||||||||||
(2Πu) | (90000) 8 | |||||||||||
B 2Σg- | 66719 | 1156 9 | 22 9 | (1.298) 10 | ||||||||
State | Te | ωe | ωexe | ωeye | Be | αe | γe | De | βe | re | Trans. | ν00 |
D (2Δg) | 62730 | 920 11 | (12) | (1.33) 12 | ||||||||
C (2Φu) | (53620) | (900) 13 | ||||||||||
b 4Σg- | 49552 | 1196.77 Z | 17.09 14 | 1.28729 15 | 0.02206 | 5.81E-6 | 1.85E-7 | 1.27964 | b 16 → a 17 V | 16666.74 Z | ||
↳Nevin, 1938; Nevin and Murphy, 1941; Weniger, 1962 | ||||||||||||
b' (4Πg) | (48000) 18 | b' ← a | ||||||||||
↳Moselev, Tadjeddine, et al., 1976 | ||||||||||||
A 2Πu | 40669.3 19 | 898.25 Z | 13.573 7 | 1.06170 | 0.01936 20 | -1.73E-4 | 5.94E-6 21 | 1.40905 | A 22 → X 23 R | 40068.1 Z | ||
↳Bozoky, 1937; Feast, 1950; Bhale and Rao, 1968; Krupenie, 1972; Albritton, Harrop, et al., 1973; Colbourn and Douglas, 1977; Bhale and Narasimham, 1976 | ||||||||||||
State | Te | ωe | ωexe | ωeye | Be | αe | γe | De | βe | re | Trans. | ν00 |
a 4Πui | 32964 24 | 1035.69 Z | 10.39 14 | 1.10466 | 0.01575 25 | 4.88E-6 25 | 1.38138 | |||||
X 2Πg | 197.3 26 | 1904.77 Z | 16.259 14 | 1.6913 | 0.01976 27 | 5.32E-6 28 | 1.1164 | |||||
0 | 1904.77 Z | 16.259 14 | 1.6913 | 0.01976 27 | 5.32E-6 28 | 1.1164 |

References

Chase, 1998
Chase, M.W., Jr.,
NIST-JANAF Themochemical Tables, Fourth Edition,
J. Phys. Chem. Ref. Data, Monograph 9, 1998, 1-1951. [all data]
Hiraoka, Nakajima, et al., 1988
Hiraoka, K.; Nakajima, G.; Shoda, S.,
Determination of the Stabilities of CO2+(CO2)n and O2+(CO2)n Clusters with n = 1 - 6,
Chem. Phys. Lett., 1988, 146, 6, 535, https://doi.org/10.1016/0009-2614(88)87495-5
. [all data]
Illies, 1988
Illies, A.J.,
Thermochemistry of the Gas - Phase Ion - Molecule Clustering of CO2+CO2, SO2+CO2, N2O+N2O, O2+CO2, NO+CO2 and NO+N2O: Description of a New Hybrid Drift Tube/Ion Source with Coaxial Electron Beam and Ion Exit Apertures,
J. Phys. Chem., 1988, 92, 10, 2889, https://doi.org/10.1021/j100321a037
. [all data]
Dotan, Davidson, et al., 1978
Dotan, I.; Davidson, J.A.; Fehsenfeld, F.C.; Albritton, D.L.,
Reactions of O2+.O2 with CO2, O3 and CH4 and O2+.O3 with H2O and CH4 and their Role in Stratospheric Ion Chemistry,
J. Geophys. Res., 1978, 83, C8, 4036, https://doi.org/10.1029/JC083iC08p04036
. [all data]
Conway and Janik, 1970
Conway, D.C.; Janik, G.S.,
Determination of the Bond Energies for the Series O2 - O2+ through O2 - O10+,
J. Chem. Phys., 1970, 53, 5, 1859, https://doi.org/10.1063/1.1674262
. [all data]
Meot-Ner (Mautner) and Field, 1977
Meot-Ner (Mautner), M.; Field, F.H.,
Proton Affinity and Ion - Molecule Clustering in CO2 and CS2. Applications in Martian Ionospheric Chemistry,
J. Chem. Phys., 1977, 66, 10, 4527, https://doi.org/10.1063/1.433706
. [all data]
Rakshit and Warneck, 1981
Rakshit, A.B.; Warneck, P.,
Formation and Reactions of O2+.CO2, O2+.H2O and O2+(CO2)2 Ions,
Int. J. Mass Spectrom Ion Phys., 1981, 40, 2, 135, https://doi.org/10.1016/0020-7381(81)80037-X
. [all data]
Hiraoka, 1988
Hiraoka, K.,
A Determination of the Stabilities of O2+(O2)n and O2-(O2)n with n = 1 - 8 from Measurements of the Gas-Phase Ion Equilibria,
J. Chem. Phys., 1988, 89, 5, 3190, https://doi.org/10.1063/1.454976
. [all data]
Durden, Kebarle, et al., 1969
Durden, D.A.; Kebarle, P.; Good, A.,
Thermal Ion-Molecule Reaction Rate Constants at Pressures up to 10 torr with a Pulsed Mass Spectrometer. Reactions in Methane, Krypton, and Oxygen,
J. Chem. Phys., 1969, 50, 2, 805, https://doi.org/10.1063/1.1671133
. [all data]
Yang and Conway, 1964
Yang, J.H.; Conway, D.C.,
Bonding in Ion Clusters. I. O4+,
J. Chem. Phys., 1964, 40, 6, 1729, https://doi.org/10.1063/1.1725389
. [all data]
Rakshit and Warneck, 1980
Rakshit, A.B.; Warneck, P.,
A Drift Chamber Study of the Formation of Water Cluster Ions in Oxygen,
J. Chem. Phys., 1980, 73, 10, 5074, https://doi.org/10.1063/1.439985
. [all data]
Howard, Bierbaum, et al., 1972
Howard, C.J.; Bierbaum, V.M.; Rundle, H.W.; Kaufman, F.,
Kinetics and Mechanism of Formation of Water Cluster Ions from O2+ and H2O+,
J. Chem. Phys., 1972, 57, 8, 3491, https://doi.org/10.1063/1.1678783
. [all data]
Adams and Bohme, 1970
Adams, N.G.; Bohme, D.,
Flowing Afterglow Studies of Formation and Reactions of Cluster Ions of O2+, O2-, and O-,
J. Chem. Phys., 1970, 52, 6, 3133, https://doi.org/10.1063/1.1673449
. [all data]
Hiraoka and Nakajima, 1988
Hiraoka, K.; Nakajima, G.,
A Determination of the Stabilities of N2+(N2)n and O2+(N2)n with n = 1 - 11 from Measurements of the Gas - Phase Ion Equilibria,
J. Chem. Phys., 1988, 88, 12, 7709, https://doi.org/10.1063/1.454285
. [all data]
Speller and Fitaire, 1983
Speller, C.V.; Fitaire, M.,
Proceedings of the 16th International Conference on Phenomena of Ionized Gases, H. Boetticher, H. Wenk and E. Shulz - Gulde, ed(s)., ICPIG, Dusseldorf, 1983, 568. [all data]
Janik and Conway, 1967
Janik, G.S.; Conway, D.C.,
Bonding in Heteromolecular Ion Clusters. N2O2+,
J. Phys. Chem., 1967, 71, 4, 823, https://doi.org/10.1021/j100863a007
. [all data]
Hiraoka, Fujimaki, et al., 1994
Hiraoka, K.; Fujimaki, S.; Aruga, K.; Sato, T.; Yamabe, S.,
Gas-Phase Solavtion of NO+, O2+, N2O+, and H3O+ with N2O,
J. Chem. Phys., 1994, 101, 5, 4073, https://doi.org/10.1063/1.467524
. [all data]
Jarrold, Misev, et al., 1984
Jarrold, M.F.; Misev, L.; Bowers, M.T.,
Charge Transfer Half - Collisions: Photodissociation of the Kr.O2+ cluster Ion with Resolution of the Product Vibrational States,
J. Chem. Phys., 1984, 81, 10, 4369, https://doi.org/10.1063/1.447448
. [all data]
Krupenie, 1972
Krupenie, P.H.,
The spectrum of molecular oxygen,
J. Phys. Chem. Ref. Data, 1972, 1, 423. [all data]
Beebe, Thulstrup, et al., 1976
Beebe, N.H.F.; Thulstrup, E.W.; Andersen, A.,
Configuration interaction calculations of low-lying electronic states of O2,O2+, and O22+,
J. Chem. Phys., 1976, 64, 2080. [all data]
LaVilla, 1975
LaVilla, R.E.,
The O Kα and C Kα emission and O K absorption spectra from O2 and CO2. IV,
J. Chem. Phys., 1975, 63, 2733. [all data]
Siegbahn, Nordling, et al., 1969
Siegbahn, K.; Nordling, C.; Johansson, G.; Hedman, J.; Heden, P.F.; Hamrin, k.; Gelius, U.; Bergmark, T.; Werme, L.O.; Manne, R.; Baer,
ESCA Applied to Free Molecules, North-Holland Publishing Company, Amsterdam, 1969, 0. [all data]
Jonathan, Morris, et al., 1974
Jonathan, N.; Morris, A.; Okuda, M.; Ross, K.J.; Smith, D.J.,
Vacuum ultraviolet photoelectron spectroscopy of transient species,
J. Chem. Soc. Faraday Trans. 2, 1974, 70, 1810. [all data]
LeBlanc, 1963
LeBlanc, F.J.,
Electronic states of Hopfield's oxygen emission bands,
J. Chem. Phys., 1963, 38, 487. [all data]
Nevin, 1938
Nevin, T.E.,
Rotational analysis of the first negative band spectrum of oxygen,
Philos. Trans. R. Soc. London A, 1938, 237, 471. [all data]
Nevin and Murphy, 1941
Nevin, T.E.; Murphy, T.,
Analysis of the (0,3) band of the first negative system of the 0g+ molecule,
Proc. R. Ir. Acad. Sect. A:, 1941, 46, 169-181. [all data]
Weniger, 1962
Weniger, S.,
Etude du spectre de la molecule d'oxygene ionisee dans le proche infra-rouge,
J. Phys. Radium, 1962, 23, 225. [all data]
Moselev, Tadjeddine, et al., 1976
Moselev, J.T.; Tadjeddine, M.; Durup, J.; Ozenne, J.-B.; Pernot, C.; Tabche-Fouhaille, A.,
High resolution threshold photofragment spectroscopy of O2+(a4Πu → f4Πg),
Phys. Rev. Lett., 1976, 37, 891. [all data]
Bozoky, 1937
Bozoky, L.v.,
Rotationsanalyse von O2+-, 2Π→2Π-banden,
Z. Phys., 1937, 104, 275. [all data]
Feast, 1950
Feast, M.W.,
New O2+ second negative bands: a note on O3 and OΠ emission spectra,
Proc. Phys. Soc. London Sect. A, 1950, 63, 557. [all data]
Bhale and Rao, 1968
Bhale, G.L.; Rao, P.R.,
Isotope shifts in the second negative bands of O2+,
Proc. Indian Acad. Sci., 1968, A67, 350. [all data]
Albritton, Harrop, et al., 1973
Albritton, D.L.; Harrop, W.J.; Schmeltekopf, A.L.; Zare, R.N.,
Rotational analysis of the A2Πu-X2Πg second negative band system of O2+,
J. Mol. Spectrosc., 1973, 46, 89. [all data]
Colbourn and Douglas, 1977
Colbourn, E.A.; Douglas, A.E.,
A remeasurement of some constants of the O2+ and N2+ molecules,
J. Mol. Spectrosc., 1977, 65, 332. [all data]
Bhale and Narasimham, 1976
Bhale, G.L.; Narasimham, N.A.,
Reinvestigation of the second negative (A2Πu-X2Πg) band system of O2+,
Pramana, 1976, 7, 324. [all data]
Edqvist, Lindholm, et al., 1970
Edqvist, O.; Lindholm, E.; Selin, L.E.; Asbrink, L.,
On the photoelectron spectrum of O2,
Physica Scripta, 1970, 1, 25. [all data]
Schopman and Locht, 1974
Schopman, J.; Locht, R.,
The observation of predissociations in the oxygen molecular ion by low-energy electron impact,
Chem. Phys. Lett., 1974, 26, 596. [all data]
Gardner and Samson, 1975
Gardner, J.L.; Samson, J.A.R.,
Photoion and photoelectron spectroscopy of oxygen,
J. Chem. Phys., 1975, 62, 4460. [all data]
Dixon and Hull, 1969
Dixon, R.N.; Hull, S.E.,
The photo-ionization of π-electrons from O2,
Chem. Phys. Lett., 1969, 3, 367. [all data]
Doolittle, Schoen, et al., 1968
Doolittle, P.H.; Schoen, R.I.; Schubert, K.E.,
Dissociative photoionization of O2,
J. Chem. Phys., 1968, 49, 5108. [all data]
Stockdale and Deleanu, 1974
Stockdale, J.A.D.; Deleanu, L.,
Vibrational structure in kinetic energy spectra of O+ ions from electron impact dissociative ionization of O2: predissociation of the B2Σg- state of O2+,
Chem. Phys. Lett., 1974, 28, 588. [all data]
Jonathan and Morris, 1971
Jonathan, N.; Morris, A.,
High resolution vacuum ultraviolet photoelectron spectra of transient species: O2(1Δg) and previously unobserved states of O2+,
J. Chem. Phys., 1971, 54, 11, 4954-4955. [all data]
Lindholm, 1968
Lindholm, E.,
Rydberg series in small molecules. IV. Rydberg series in O2,
Ark. Fys., 1968, 40, 9, 117-124. [all data]
Albritton, Schmeltekopf, et al., 1979
Albritton; Schmeltekopf; Zare,
Diatomic Intensity Factors, to be published, cited in Huber and Herzberg, 1979, Wiley, 1979, 1. [all data]
Halmann and Laulicht, 1965
Halmann, M.; Laulicht, I.,
Isotope effects on vibrational transition probabilities. III. Ionization of isotopic H2, N2,,O2, NO, CO, and HCl molecules,
J. Chem. Phys., 1965, 43, 1503. [all data]
Asundi and Ramachandrarao, 1969
Asundi, R.K.; Ramachandrarao, Ch.V.S.,
Revised Franck-Condon factors for the ionization transition of O2 and the second negative band system of O2+,
Chem. Phys. Lett., 1969, 4, 89. [all data]
Spohr and Puttkamer, 1967
Spohr, R.; Puttkamer, E.v.,
Energiemessung von Photoelektronen und Franck-Condon-Faktoren der Schwingungsubergange einiger Molekulionen,
Z. Naturforsch., 1967, 22a, 705. [all data]
Gardner and Samson, 1974
Gardner, J.L.; Samson, J.A.R.,
Vibrational intensity distributions for continuum photoionization of oxygen,
J. Chem. Phys., 1974, 61, 5472. [all data]
Jeunehomme, 1966
Jeunehomme, M.,
Oscillator strengths of the negative systems of oxygen,
J. Chem. Phys., 1966, 44, 4253. [all data]
Fink and Welge, 1968
Fink, E.H.; Welge, K.H.,
Lebensdauern und Loschquerschnitte elektronisch angeregter Zustande von N2O+, NO, O2+, CO+ und CO,
Z. Naturforsch. A, 1968, 23, 358. [all data]
Borst and Zipf, 1970
Borst, W.L.; Zipf, E.C.,
Excitation of O2+ first negative bands by electron impact on O2,
Phys. Rev. A: Gen. Phys., 1970, 1, 1410. [all data]
Fairbairn, 1974
Fairbairn, A.R.,
Radiative lifetime of O2+,
J. Chem. Phys., 1974, 60, 521. [all data]
Rao, 1963
Rao, P.S.R.,
Vibrational intensities of the O2+ (first negative) bands,
Proc. Phys. Soc. London, 1963, 81, 240. [all data]
Nicolet and Dogniaux, 1950
Nicolet, M.; Dogniaux, R.,
Nouvelles suggestions au sujet de l'interpretation du spectre des aurores,
J. Geophys. Res., 1950, 55, 21. [all data]
Vegard, 1950
Vegard, L.,
Nouveaux resultats importants dans l'etude du spectre des aurores boreales et la physique de l'ionosphere,
Ann. Geophys., 1950, 6, 157. [all data]
Dahlstrom and Hunten, 1951
Dahlstrom, C.E.; Hunten, D.M.,
O2+ and H in the auroral spectrum,
Phys. Rev., 1951, 84, 378. [all data]
Rao, 1964
Rao, P.S.R.,
A comparison of intensities of the O2+ (first negative) bands excited in a hollow-cathode discharge and in aurorae,
Nature (London), 1964, 201, 1112. [all data]
Nishimura, 1968
Nishimura, H.,
Excitation of N2+, O2+ and CO2+ band of electron impact,
J. Phys. Soc. Jpn., 1968, 24, 130. [all data]
Herman, Ferguson, et al., 1961
Herman, L.; Ferguson, H.I.S.; Nicholls, R.W.,
Excitation of the first negative system of O2+ by a proton beam in air and oxygen,
Can. J. Phys., 1961, 39, 476. [all data]
Dufay, Druetta, et al., 1965
Dufay, M.; Druetta, M.; Eidelsberg, M.,
Sur la luminescence de l'oxygene excitee par choc de particules accelerees sous 500 keV,
C.R. Acad. Sci. Paris, 1965, 260, 1123. [all data]
Zare, 1972
Zare, R.N.,
Rotational line strengths: the O2+b4Σg- - a4Πu band system
in Molecular Spectroscopy: Modern Research, Rao,K.N.; Mathews,C.W., ed(s)., Academic Press, New York, 1972, 207-221. [all data]
Bhale, 1972
Bhale, G.L.,
Spin-orbit coupling constant in the A2Πu state of O2+,
J. Mol. Spectrosc., 1972, 43, 171. [all data]
Raftery and Richards, 1975
Raftery, J.; Richards, W.G.,
On the variation of the spin-orbit coupling in O2+,
J. Chem. Phys., 1975, 62, 3184. [all data]
Branscomb, 1950
Branscomb, L.M.,
Anomalous molecular rotation and the temperature of the upper atmosphere,
Phys. Rev., 1950, 79, 619. [all data]
Albritton, Schmeltekopf, et al., 1969
Albritton, D.L.; Schmeltekopf, A.L.; Zare, R.N.,
Evidence in support of the vibrational renumbering of the O2+ 2πg ground state,
J. Chem. Phys., 1969, 51, 1667. [all data]
Kovacs and Weniger, 1962
Kovacs, I.; Weniger, S.,
Sur l'interpretation de la separation anomale des composantes du multiplet de l'etat 4Π de la molecule d'oxygene ionisee,
J. Phys. Radium, 1962, 23, 377. [all data]
Budo and Kovacs, 1955
Budo, A.; Kovacs, I.,
Uber den 4Π-Zustand des O2+-Molekuls,
Acta Phys. Acad. Sci. Hung., 1955, 4, 273. [all data]
Veseth, 1975
Veseth, L.,
Fine structure of 4Π states in diatomic molecules,
Phys. Scr., 1975, 12, 125. [all data]
Dorman and Morrison, 1963
Dorman, F.H.; Morrison, J.D.,
Ionization potentials of doubly charged oxygen and nitrogen,
J. Chem. Phys., 1963, 39, 1906. [all data]
Daly and Powell, 1967
Daly, N.R.; Powell, R.E.,
Electron collisions in oxygen,
Proc. Phys. Soc. (London), 1967, 90, 629. [all data]
Gardner and Samson, 1975, 2
Gardner, J.L.; Samson, J.A.R.,
Vibrational structure in the photoelectron spectrum of O2+2Σg-(σg2s),
Chem. Phys. Lett., 1975, 32, 315. [all data]
Huber and Herzberg, 1979
Huber, K.P.; Herzberg, G.,
Molecular Spectra and Molecular Structure. IV. Constants of Diatomic Molecules, Van Nostrand Reinhold Company, New York, 1979, 716. [all data]