Hydrogen cation
- Formula: H2+
- Molecular weight: 2.01533
- IUPAC Standard InChIKey: ZZIJOQHRUPVPQC-UHFFFAOYSA-N
- CAS Registry Number: 12184-90-6
- Chemical structure:
View 3d structure (requires JavaScript / HTML 5) - Permanent link for this species. Use this link for bookmarking this species for future reference.

Gas phase thermochemistry data

Quantity | Value | Units | Method | Reference | Comment |
---|---|---|---|---|---|
S°gas,1 bar | 142.39 | J/mol*K | Review | Chase, 1998 | Data last reviewed in September, 1977 |

Reaction thermochemistry data

Data compiled by: Michael M. Meot-Ner (Mautner) and Sharon G. Lias
Individual Reactions
By formula: H2+ + Ar = (H2+ • Ar)
Quantity | Value | Units | Method | Reference | Comment |
---|---|---|---|---|---|
ΔrH° | 100. | kJ/mol | SIFT | Bedford and Smith, 1990 | gas phase; switching reaction(Ar+)Ar, ΔrH> |

Constants of diatomic molecules

Data compiled by: Klaus P. Huber and Gerhard H. Herzberg
Data collected through November, 1976
Symbol | Meaning |
---|---|
State | electronic state and / or symmetry symbol |
Te | minimum electronic energy (cm-1) |
ωe | vibrational constant – first term (cm-1) |
ωexe | vibrational constant – second term (cm-1) |
ωeye | vibrational constant – third term (cm-1) |
Be | rotational constant in equilibrium position (cm-1) |
αe | rotational constant – first term (cm-1) |
γe | rotation-vibration interaction constant (cm-1) |
De | centrifugal distortion constant (cm-1) |
βe | rotational constant – first term, centrifugal force (cm-1) |
re | internuclear distance (Å) |
Trans. | observed transition(s) corresponding to electronic state |
ν00 | position of 0-0 band (units noted in table) |
State | Te | ωe | ωexe | ωeye | Be | αe | γe | De | βe | re | Trans. | ν00 |
---|---|---|---|---|---|---|---|---|---|---|---|---|
Several other excited states, mostly repulsive. 1 | ||||||||||||
C 2Πu 2pπ | (102696.7) 2 | (266.01) | (6.454) | (1.899) | (0.0758) | (0.00039) | (4.198) | (C-B) | (8806.3) 2 | |||
↳Bishop, Shih, et al., 1975 | ||||||||||||
B 2Σg+ 3dσ | (93804.5) 2 | (437.15) | (5.247) | (1.530) | (0.0312) | (0.000075) | (4.677) | (B-X) | (92877.4) | |||
↳Bishop, Shih, et al., 1975 | ||||||||||||
A 2Σu+ 2pσ 3 | A ← X | |||||||||||
↳Richardson, Jefferts, et al., 1968 | ||||||||||||
State | Te | ωe | ωexe | ωeye | Be | αe | γe | De | βe | re | Trans. | ν00 |
X 2Σg+ 1sσ | 0 | 2321.7 4 | 66.2 4 | 0.6 | 30.21 4 5 6 | 1.685 4 | 0.6 | 4 | 1.052 7 8 | |||
↳Jefferts, 1969 |

Ion clustering data

Data compiled by: Michael M. Meot-Ner (Mautner) and Sharon G. Lias
Clustering reactions
By formula: H2+ + Ar = (H2+ • Ar)
Quantity | Value | Units | Method | Reference | Comment |
---|---|---|---|---|---|
ΔrH° | 100. | kJ/mol | SIFT | Bedford and Smith, 1990 | gas phase; switching reaction(Ar+)Ar, ΔrH> |

References

Chase, 1998
Chase, M.W., Jr.,
NIST-JANAF Themochemical Tables, Fourth Edition,
J. Phys. Chem. Ref. Data, Monograph 9, 1998, 1-1951. [all data]
Bedford and Smith, 1990
Bedford, D.K.; Smith, D.,
Variable-temperature selected ion flow tube studies of the reactions of Ar+, Ar2+ and ArHn+ (n=1-3) ions with H2, HD and D2 at 300 K and 80 K,
Int. J. Mass Spectrom. Ion Proc., 1990, 98, 2, 179, https://doi.org/10.1016/0168-1176(90)85017-V
. [all data]
Bishop, Shih, et al., 1975
Bishop, D.M.; Shih, S.-K.; Beckel, C.L.; Wu, F.-M.; Peek, J.M.,
Theoretical study of H2+ spectroscopic properties. IV. Adiabatic effects for the 2pπu and 3dσg electronic states,
J. Chem. Phys., 1975, 63, 4836. [all data]
Richardson, Jefferts, et al., 1968
Richardson, C.B.; Jefferts, K.B.; Dehmelt, H.G.,
Alignment of the H2+ molecular ion by selective photodissociation. II. Experiments on the radio-frequency spectrum,
Phys. Rev., 1968, 165, 80. [all data]
Jefferts, 1969
Jefferts, K.B.,
Hyperfine structure in the molecular ion H2+,
Phys. Rev. Lett., 1969, 23, 1476. [all data]
Bates, Ledsham, et al., 1953
Bates, D.R.; Ledsham, K.; Stewart, A.L.,
Wave functions of the hydrogen molecular ion,
Philos. Trans. R. Soc. London A, 1953, 246, 215. [all data]
Kroll, 1970
Kroll, M.,
A prediction of the discrete electronic transition 2pπu-3dσg of H2+,
J. Mol. Spectrosc., 1970, 35, 436. [all data]
Herzberg and Jungen, 1972
Herzberg, G.; Jungen, Ch.,
Rydberg series and ionization potential of the H2 molecule,
J. Mol. Spectrosc., 1972, 41, 425. [all data]
Cunningham and Dieke, 1950
Cunningham; Dieke,
Johns Hopkins University, Department of Physics, Rpt. NYO-692, 1950, 1. [all data]
Siegbahn, Nordling, et al., 1967
Siegbahn, K.; Nordling, C.; Fahlman, A.; Nordberg, R.; Hamrin, K.; Hedman, J.; Johansson, G.; Bergmark, T.; Karlsson, S.-E.; Lindgren, I.; Lindberg, B.,
ESCA. Atomic, molecular and solid state structure studied by means of electron spectroscopy,
Nova Acta Regiae Soc. Sci. Ups., 1967, 20, 208-282. [all data]
Asbrink, 1970
Asbrink, L.,
The photoelectron spectrum of H2,
Chem. Phys. Lett., 1970, 7, 549. [all data]
Peek, 1965
Peek, J.M.,
On the 2Σg+ and 2Σu+ states of the hydrogen molecule ion, Sandia Laboratory, Albuquerque, NM, 1965, 49. [all data]
Hunter, Yau, et al., 1974
Hunter, G.; Yau, A.W.; Pritchard, H.O.,
Rotation-vibration level energies of the hydrogen and deuterium molecule-ions,
At. Data Nucl. Data Tables, 1974, 14, 11. [all data]
Luke, Hunter, et al., 1969
Luke, S.K.; Hunter, G.; McEachran, R.P.; Cohen, M.,
Relativistic theory of H2+,
J. Chem. Phys., 1969, 50, 1644. [all data]
Gersten, 1969
Gersten, J.I.,
Evaluation of the lamb shift for the hydrogen molecule-ion,
J. Chem. Phys., 1969, 51, 3181. [all data]
Jeziorski and Kolos, 1969
Jeziorski, B.; Kolos, W.,
On the ionization potential of H2,
Chem. Phys. Lett., 1969, 3, 677. [all data]
Bishop, 1974
Bishop, D.M.,
Non-adiabatic calculations for H2+, HD+ and D2+,
Mol. Phys., 1974, 28, 1397. [all data]
Wind, 1965
Wind, H.,
Vibrational States of the hydrogen molecular ion,
J. Chem. Phys., 1965, 43, 2956. [all data]
Hunter and Pritchard, 1967
Hunter, G.; Pritchard, H.O.,
Born-Oppenheimer separation for three-particle systems. III. Applications,
J. Chem. Phys., 1967, 46, 2153. [all data]
Beckel, Hansen, et al., 1970
Beckel, C.L.; Hansen, B.D., III; Peek, J.M.,
Theoretical study of H2+ ground electronic state spectroscopic properties,
J. Chem. Phys., 1970, 53, 3681. [all data]
Halmann and Laulicht, 1965
Halmann, M.; Laulicht, I.,
Isotope effects on vibrational transition probabilities. III. Ionization of isotopic H2, N2,,O2, NO, CO, and HCl molecules,
J. Chem. Phys., 1965, 43, 1503. [all data]
Dunn, 1966
Dunn, G.H.,
Franck-Condon factors for the ionization of H2 and D2,
J. Chem. Phys., 1966, 44, 2592. [all data]
Nicholls, 1968
Nicholls, R.W.,
Franck-Condon factors for ionizing transitions of O2, CO, NO and H2 and for the NO+(A1-Σx1Σ) band system,
J. Phys. B:, 1968, 1, 1192. [all data]
Itikawa, 1973
Itikawa, Y.,
Calculation of the cross sections for the photoionization of H2 and D2 into different vibrational states of the ion,
J. Electron Spectrosc. Relat. Phenom., 1973, 2, 125. [all data]
Spohr and Puttkamer, 1967
Spohr, R.; Puttkamer, E.v.,
Energiemessung von Photoelektronen und Franck-Condon-Faktoren der Schwingungsubergange einiger Molekulionen,
Z. Naturforsch., 1967, 22a, 705. [all data]
Berkowitz and Spohr, 1973
Berkowitz, J.; Spohr, R.,
Comparison of photoelectron intensities and Franck-Condon factors in the photoionization of H2, HD and D2,
J. Electron Spectrosc. Relat. Phenom., 1973, 2, 143. [all data]
Schaad and Hicks, 1970
Schaad, L.J.; Hicks, W.V.,
Equilibrium bond length in H2+,
J. Chem. Phys., 1970, 53, 851. [all data]
Samson, 1972
Samson, J.A.R.,
Observation of double electron excitation in H2 by photoelectron spectroscopy,
Chem. Phys. Lett., 1972, 12, 625. [all data]
Peek, 1969
Peek, J.M.,
Discrete vibrational states due only to long-range forces: 2Σu+(2pσu) state of H2+,
J. Chem. Phys., 1969, 50, 4595. [all data]