Dichlorobis(η5-2,4-cyclopentadien-1-yl)molybdenium
- Formula: C10H10Cl2Mo
- Molecular weight: 297.05
- CAS Registry Number: 12184-22-4

Phase change data

Data compiled as indicated in comments:
AC - William E. Acree, Jr., James S. Chickos
MS - José A. Martinho Simões
Quantity | Value | Units | Method | Reference | Comment |
---|---|---|---|---|---|
ΔsubH° | 24.0 ± 1.0 | kcal/mol | E | Tel'noi, Rabinovich, et al., 1976 | AC |
ΔsubH° | 24.0 ± 1.0 | kcal/mol | CC-SB | Tel'noi, Rabinovich, et al., 1976 | MS |

Reaction thermochemistry data

Data compiled by: José A. Martinho Simões
Individual Reactions
C12H16Mo (cr) + 2( • 5.55
) (solution) = C10H10Cl2Mo (cr) + 2
(g)
By formula: C12H16Mo (cr) + 2(HCl • 5.55H2O) (solution) = C10H10Cl2Mo (cr) + 2CH4 (g)
Quantity | Value | Units | Method | Reference | Comment |
---|---|---|---|---|---|
ΔrH° | -46.27 ± 0.72 | kcal/mol | RSC | Calado, Dias, et al., 1978 | Please also see Calhorda, Dias, et al., 1987. |
C14H10F6MoO4 (cr) + 2( • 4.40
) (solution) = C10H10Cl2Mo (cr) + 2
(l)
By formula: C14H10F6MoO4 (cr) + 2(HCl • 4.40H2O) (solution) = C10H10Cl2Mo (cr) + 2C2HF3O2 (l)
Quantity | Value | Units | Method | Reference | Comment |
---|---|---|---|---|---|
ΔrH° | 13.9 ± 0.60 | kcal/mol | RSC | Calado, Dias, et al., 1981 | Please also see Calhorda, Carrondo, et al., 1986. |
C10H12Mo (cr) + 2 (l) = C10H10Cl2Mo (cr) + 2
(l)
By formula: C10H12Mo (cr) + 2CCl4 (l) = C10H10Cl2Mo (cr) + 2CHCl3 (l)
Quantity | Value | Units | Method | Reference | Comment |
---|---|---|---|---|---|
ΔrH° | -76.8 ± 1.1 | kcal/mol | RSC | Calado, Dias, et al., 1979 |

Gas phase thermochemistry data

Data compiled by: José A. Martinho Simões
Quantity | Value | Units | Method | Reference | Comment |
---|---|---|---|---|---|
ΔfH°gas | 1. ± 1.2 | kcal/mol | Review | Martinho Simões | Selected data |

Condensed phase thermochemistry data

Data compiled by: José A. Martinho Simões
Quantity | Value | Units | Method | Reference | Comment |
---|---|---|---|---|---|
ΔfH°solid | -23.0 ± 0.69 | kcal/mol | Review | Martinho Simões | Selected data |
Quantity | Value | Units | Method | Reference | Comment |
ΔcH°solid | -1448.2 ± 0.60 | kcal/mol | CC-SB | Tel'noi, Rabinovich, et al., 1976 | Please also see Tel'noi and Rabinovich, 1977. |

References

Tel'noi, Rabinovich, et al., 1976
Tel'noi, V.I.; Rabinovich, I.B.; Kir'yanov, K.V.; Smirnov, A.S.,
Dokl. Akad. Nauk SSSR, 1976, 231, 733. [all data]
Calado, Dias, et al., 1978
Calado, J.C.G.; Dias, A.R.; Martinho Simões, J.A.; Ribeiro da Silva, M.A.V.,
J. Chem. Soc., Chem. Commun., 1978, 737.. [all data]
Calhorda, Dias, et al., 1987
Calhorda, M.J.; Dias, A.R.; Minas da Piedade M.E.; Salema, M.S.; Martinho Simões J.A.,
Organometallics, 1987, 6, 734. [all data]
Calado, Dias, et al., 1981
Calado, J.C.G.; Dias, A.R.; Salema, M.S.; Martinho Simões, J.A.,
J. Chem. Soc., Dalton Trans., 1981, 1174.. [all data]
Calhorda, Carrondo, et al., 1986
Calhorda, M.J.; Carrondo, M.A.A.F.C.T.; Dias, A.R.; Domingos, A.M.T.S.; Martinho Simões, J.A.; Teixeira, C.,
Organometallics, 1986, 5, 660. [all data]
Calado, Dias, et al., 1979
Calado, J.C.G.; Dias, A.R.; Martinho Simões, J.A.; Ribeiro da Silva, M.A.V.,
J. Organometal. Chem., 1979, 174, 77. [all data]