L-Tryptophan, N-acetyl-
- Formula: C13H14NO3
- Molecular weight: 232.2552
- IUPAC Standard InChIKey: DZTHIGRZJZPRDV-GFCCVEGCSA-N
- CAS Registry Number: 1218-34-4
- Chemical structure:
View 3d structure (requires JavaScript / HTML 5) - Stereoisomers:
- Other names: Tryptophan, N-acetyl-, L-; AC-Try; Acetyl-L-tryptophan; Acetyltryptophan; N-Acetyl-L-tryptophan; N-Acetyltryptophan; Acetyl-L-trp; (S)-N-Acetyltryptophan; NSC 90726; Tryptophan, acetyl

Reaction thermochemistry data

Data compiled by: Robert C. Dunbar
Individual Reactions
By formula: Na+ + C13H14NO3 = (Na+ • C13H14NO3)
Free energy of reaction
ΔrG° (kJ/mol) | T (K) | Method | Reference |
---|---|---|---|
156. | 0. | CIDC | Feng, Gronert, et al., 1999 |

Ion clustering data

Data compiled by: Robert C. Dunbar
Clustering reactions
By formula: Na+ + C13H14NO3 = (Na+ • C13H14NO3)
Free energy of reaction
ΔrG° (kJ/mol) | T (K) | Method | Reference |
---|---|---|---|
156. | 0. | CIDC | Feng, Gronert, et al., 1999 |

References

Feng, Gronert, et al., 1999
Feng, W.Y.; Gronert, S.; Lebrilla, C.B.,
Lithium and sodium ion binding energies of N-acetyl and N-glycyl amino acids,
J. Am. Chem. Soc., 1999, 121, 6, 1365, https://doi.org/10.1021/ja983116s
. [all data]