Hydrogen-d1 cation

Gas phase thermochemistry data

Quantity Value Units Method Reference Comment
gas,1 bar155.57J/mol*KReviewChase, 1998Data last reviewed in June, 1977

Constants of diatomic molecules

Data compiled by: Klaus P. Huber and Gerhard H. Herzberg

Data collected through November, 1976

Symbols used in the table of constants
SymbolMeaning
State electronic state and / or symmetry symbol
Te minimum electronic energy (cm-1)
ωe vibrational constant – first term (cm-1)
ωexe vibrational constant – second term (cm-1)
ωeye vibrational constant – third term (cm-1)
Be rotational constant in equilibrium position (cm-1)
αe rotational constant – first term (cm-1)
γe rotation-vibration interaction constant (cm-1)
De centrifugal distortion constant (cm-1)
βe rotational constant – first term, centrifugal force (cm-1)
re internuclear distance (Å)
Trans. observed transition(s) corresponding to electronic state
ν00 position of 0-0 band (units noted in table)
Diatomic constants for HD+
StateTeωeωexeωeyeBeαeγeDeβereTrans.ν00
X 2Σg+ 1sσ 0 [1913.1] 1   (22.452) 2 (1.001) 2  (0.011) 2  (1.057) 3
Wing, Ruff, et al., 1976

References

Chase, 1998
Chase, M.W., Jr., NIST-JANAF Themochemical Tables, Fourth Edition, J. Phys. Chem. Ref. Data, Monograph 9, 1998, 1-1951. [all data]