Propyl gallate
- Formula: C10H12O5
- Molecular weight: 212.1993
- IUPAC Standard InChIKey: ZTHYODDOHIVTJV-UHFFFAOYSA-N
- CAS Registry Number: 121-79-9
- Chemical structure:
View 3d structure (requires JavaScript / HTML 5) - Other names: Benzoic acid, 3,4,5-trihydroxy-, propyl ester; Gallic acid, propyl ester; n-Propyl gallate; n-Propyl 3,4,5-trihydroxybenzoate; Nipa 49; Nipagallin P; Progallin P; Propyl 3,4,5-trihydroxybenzoate; Tenox PG; Gallic acid n-propyl ester; n-Propyl ester of 3,4,5-trihydroxybenzoic acid; NCI-C505888; 3,4,5-Trihydroxybenzene-1-propylcarboxylate; 3,4,5-Trihydroxybenzoic acid, propyl ester; Propylester kyseliny gallove; 3,4,5-Trihydroxybenzoic acid n-propyl ester; PG; NSC 2626

Reaction thermochemistry data

Data compiled by: Hussein Y. Afeefy, Joel F. Liebman, and Stephen E. Stein
Individual Reactions
By formula: C10H12O5 + H2O = C7H6O5 + C3H8O
Quantity | Value | Units | Method | Reference | Comment |
---|---|---|---|---|---|
ΔrH° | -15.4 ± 6.6 | kJ/mol | Eqk | Tewari, Schantz, et al., 1996 | liquid phase; solvent: Toluene |

References

Tewari, Schantz, et al., 1996
Tewari, Y.B.; Schantz, M.M.; Rekharsky, M.V.; Goldberg, R.N.,
Thermodynamics of the hydrolysis of 3,4,5-trihydroxybenzoic acid propyl ester (n-propylgallate) to 3,4,5-trihydroxybenzoic acid (gallic acid) and propan-1-ol in aqueous media and in toluene,
J. Chem. Thermodyn., 1996, 28, 171-185. [all data]