Malathion
- Formula: C10H19O6PS2
- Molecular weight: 330.358
- IUPAC Standard InChIKey: JXSJBGJIGXNWCI-UHFFFAOYSA-N
- CAS Registry Number: 121-75-5
- Chemical structure:
View 3d structure (requires JavaScript / HTML 5) - Other names: Butanedioic acid, [(dimethoxyphosphinothioyl)thio]-, diethyl ester; Succinic acid, mercapto-, diethyl ester, S-ester with O,O-dimethyl phosphorodithioate; [(Dimethoxyphosphinothioyl)thio]butanedioic acid, diethyl ester; American Cyanamid 4,049; Carbetox; Carbofos; Carbophos; Compound 4049; Cythion; Ethiolacar; Etiol; ENT 17,034; Fosfothion; Fosfotion; Fyfanon; Insecticide No. 4049; Karbofos; Malafor; Malamar 50; Malaspray; Malathion E50; Malathion LV Concentrate; Malatol; Mercaptosuccinic acid diethyl ester, S-ester with O,O-dimethyl phosphorothioate; Mercaptothion; Moscarda; O,O-Dimethyl S-(1,2-dicarbethoxyethyl) dithiophosphate; Oleophosphothion; Ortho Malathion; Phosphothion; Prioderm; S-[1,2-Bis(carbethoxy)ethyl] O,O-dimethyl dithiophosphate; S-[1,2-Bis(ethoxycarbonyl)ethyl] O,O-dimethyl phosphorodithioate; Sadofos; Sadophos; Siptox I; Staeubol-Puder; Sumitox; SF 60; TM-4049; Zithiol; AC 26691; Carbethoxy malathion; Chemathion; Dicarboethoxyethyl O,O-dimethyl phosphorodithioate; Diethyl mercaptosuccinate, O,O-dimethyl dithiophosphate, S-ester; Diethyl mercaptosuccinate, O,O-dimethyl phosphorodithioate; Diethyl mercaptosuccinate, O,O-dimethyl thiophosphate; Diethyl mercaptosuccinic acid, S-ester of O,O-dimethyl phosphorodithioate; Diethyl 2-(dimethoxyphosphinothioylthio)succinate; Dithiophosphate de O,O-dimethyle et de S-(1,2-dicarboethoxyethyle); Emmatos; Emmatos extra; Experimental insecticide 4049; Formal; Four thousand forty-nine; Malagran; Malakill; Malamar; Malaphos; Malathione; Malathon; Malation; Malatox; Malphos; MLT; NCI-C00215; O,O-Dimethyl dithiophosphate diethylmercaptosuccinate; O,O-Dimethyl S-(1,2-dicarbethoxyethyl) phosphorodithioate; O,O-Dimethyl S-(1,2-dicarbethoxyethyl) thiothionophosphate; O,O-Dimethyl S-1,2-di(ethoxycarbamyl)ethyl phosphorothioate; O,O-Dimethyl-S-1,2-dikarbetoxylethylditiofosfat; S-(1,2-Bis(aethoxy-carbonyl)-aethyl)-O,O-dimethyl-dithiophasphat; S-(1,2-Bis(ethoxy-carbonyl)-ethyl)-O,O-dimethyl-dithiofosfaat; S-(1,2-Bis(etossi-carbonil)-etil)-O,O-dimetil-ditiofosfato; S-(1,2-Dicarbethoxyethyl) O,O-dimethyl phosphorodithioate; S-1,2-Bis(ethoxycarbonyl)ethyl-O,O-dimethyl thiophosphate; Taskil; 1,2-Di(ethoxycarbonyl)ethyl O,O-dimethyl phosphordithioate; Calmathion; Carbetovur; Celthion; Cimexan; Detmol MA; S-(1,2-Dicarbethoxyethyl) O,O-dimethyldithiophosphate; 1,2-Di(ethoxycarbonyl)ethyl O,O-dimethyl phosphorodithioate; S-(1,2-Di(ethoxycarbonyl)ethyl) dimethyl phosphorothiolothionate; Diethyl (dimethoxyphosphinothioylthio) butanedioate; Diethyl (dimethoxyphosphinothioylthio)succinate; Diethyl mercaptosuccinate S-ester with O,O-dimethyl phosphorodithioate; Diethyl mercaptosuccinic acid O,O-dimethyl phosphorodithioate; O,O-Dimethyl S-1,2-di(ethoxycarbamyl)ethyl phosphorodithioate; O,O-Dwumetylo-S-1,2-bis(karboetoksyetylo)-dwutiofosforan; EL 4049; Extermathion; Forthion; Fosfotion 550; Hilthion; Hilthion 25WDP; Kop-thion; Kypfos; Latka 4049; Malacide; Malaphele; Malasol; Malathiozoo; Maldison; Malmed; Maltox; Maltox MLT; Mercaptosuccinic acid diethyl ester; Mercaptotion; NA 2783; OMS 1; Sadofos 30; TAK; Vegfru malatox; Vetiol; Cleensheen; Derbac-M; Diethyl [(dimethoxyphosphinothoiyl)thio]butanedioate; O,O-Dimethyl-S-(1,2-di(ethoxycarbonyl)ethyl) phosphorodithioate; Organoderm; Suleo M; Gammaxine; Ovide; Radotion; Malataf; Malathion ULV; Malathyl; Malathyne; (dl) malathion

Phase change data

Data compiled as indicated in comments:
TRC - Thermodynamics Research Center, NIST Boulder Laboratories, Chris Muzny director
AC - William E. Acree, Jr., James S. Chickos
Quantity | Value | Units | Method | Reference | Comment |
---|---|---|---|---|---|
Tfus | 273.95 | K | N/A | Witschonke, 1954 | Metastable crystal phase; Uncertainty assigned by TRC = 0.5 K; TRC |
Tfus | 275.95 | K | N/A | Witschonke, 1954 | Crystal phase 1 phase; Uncertainty assigned by TRC = 0.35 K; TRC |
Tfus | 276.25 | K | N/A | Witschonke, 1954 | Crystal phase 1 phase; Uncertainty assigned by TRC = 0.25 K; TRC |
Quantity | Value | Units | Method | Reference | Comment |
ΔvapH° | 71.1 | kJ/mol | A | Stephenson and Malanowski, 1987 | Based on data from 283. to 419. K.; AC |

Henry's Law data

Data compiled by: Rolf Sander
Henry's Law constant (water solution)
kH(T) = k°H exp(d(ln(kH))/d(1/T) ((1/T) - 1/(298.15 K)))
k°H = Henry's law constant for solubility in water at 298.15 K (mol/(kg*bar))
d(ln(kH))/d(1/T) = Temperature dependence constant (K)
k°H (mol/(kg*bar)) | d(ln(kH))/d(1/T) (K) | Method | Reference |
---|---|---|---|
2700. | L | N/A |

Kovats' RI, non-polar column, isothermal

Column type | Active phase | Temperature (C) | I | Reference | Comment |
---|---|---|---|---|---|
Capillary | OV-1 | 190. | 1931. | Erdmann, Rochholz, et al., 1992 | |
Capillary | OV-1 | 220. | 1934. | Erdmann, Rochholz, et al., 1992 | |
Packed | SE-30 | 210. | 1926. | Oyama, Sano, et al., 1987 | N2, AW-DMCS; Column diameter: 0.53 mm |
Capillary | SPB-1 | 250. | 1930. | Lora-Tamayo, Rams, et al., 1986 | He; Column length: 25. m; Column diameter: 0.20 mm |

Kovats' RI, non-polar column, temperature ramp

Column type | Active phase | I | Reference | Comment |
---|---|---|---|---|
Capillary | DB-1 | 1938. | Hall, Whitehead, et al., 1986 | He, 6. K/min; Column length: 15. m; Column diameter: 0.25 mm; Tstart: 100. C; Tend: 270. C |
Capillary | SE-30 | 1922. | Schepers, Wijsbeek, et al., 1982 | 12. m/0.22 mm/0.45 μm, He, 120. C @ 2. min, 8. K/min, 300. C @ 12. min |
Capillary | SE-30 | 1920. | Schepers, Wijsbeek, et al., 1982 | 25. m/0.49 mm/1.14 μm, 100. C @ 2. min, 8. K/min, 275. C @ 15. min |

Kovats' RI, non-polar column, custom temperature program

Column type | Active phase | I | Reference | Comment |
---|---|---|---|---|
Capillary | HP-5 | 1962. | Tanabe, Mitobe, et al., 2000 | 30. m/0.32 mm/0.25 μm; Program: 50C(1min) => 20C/min => 150C => 10C/min => 280C(4min) |
Packed | SE-30 | 1917. | Osselton and Snelling, 1986 | N2, Chromosorb W HP; Column length: 2. m; Program: not specified |

Van Den Dool and Kratz RI, non-polar column, temperature ramp

Column type | Active phase | I | Reference | Comment |
---|---|---|---|---|
Capillary | SLB-5MS | 1959. | Mondello, Casilli, et al., 2007 | 30. m/0.25 mm/0.25 μm, He, 2. K/min; Tstart: 70. C; Tend: 300. C |
Capillary | SLB-5MS | 1965. | Mondello, Casilli, et al., 2007 | 30. m/0.25 mm/0.25 μm, He, 2. K/min; Tstart: 70. C; Tend: 300. C |
Capillary | OV-1 | 1919. | Bicchi, D'Amato, et al., 1996 | 25. m/0.25 mm/0.3 μm, H2, 160. C @ 1. min, 5. K/min, 260. C @ 2. min |
Packed | OV-1 | 1946. | Oyama, Sano, et al., 1987 | N2, AW-DMCS, 2. K/min; Column diameter: 0.53 mm; Tstart: 80. C; Tend: 220. C |

Van Den Dool and Kratz RI, non-polar column, custom temperature program

Column type | Active phase | I | Reference | Comment |
---|---|---|---|---|
Capillary | OV-1 | 1919. | Bicchi, D'Amato, et al., 1994 | 25. m/0.25 mm/0.3 μm; Program: from 160 0C (1 min) at 1 0/min to 170 0C, then 5 0/min to 270 0C (2min) |

Normal alkane RI, non-polar column, isothermal

Column type | Active phase | Temperature (C) | I | Reference | Comment |
---|---|---|---|---|---|
Packed | OV-1 | 190. | 1930. | TSunoda, 1986 | Helium, Chromosorb W AW DMCS; Column length: 1. m |

Normal alkane RI, non-polar column, temperature ramp

Column type | Active phase | I | Reference | Comment |
---|---|---|---|---|
Packed | OV-1 | 1930. | TSunoda, 1986 | Helium, Chromosorb W AW DMCS, 4. K/min, 210. C @ 20. min; Column length: 1. m; Tstart: 140. C |
Packed | SE-30 | 1920. | Marozzi, Gambaro, et al., 1982 | Gas Chrom P, 2.5 K/min; Column length: 2. m; Tstart: 120. C; Tend: 200. C |

Normal alkane RI, non-polar column, custom temperature program

Column type | Active phase | I | Reference | Comment |
---|---|---|---|---|
Capillary | 5 % Phenyl methyl siloxane | 1963. | Department of Food Safety and Welfare, 2006 | 30. m/0.25 mm/0.25 μm, Helium; Program: 50 0C(1 min) 25 0C/min -> 125 0C 10 0C/min -> 300 0C (10 min) |
Capillary | 5 % Phenyl methyl siloxane | 1965. | Department of Food Safety and Welfare, 2006 | 30. m/0.25 mm/0.25 μm, Helium; Program: 50 0C(1 min) 25 0C/min -> 125 0C 10 0C/min -> 300 0C (10 min) |
Capillary | HP-5 | 1962. | Kawara, Asada, et al., 2005 | 30. m/0.25 mm/0.25 μm; Program: 50 0C (1 min) 20 0C/min -> 150 0C 10 0C/min -> 280 0C |
Capillary | Methyl Silicone | 1928. | Zenkevich, Ostroukhova, et al., 2002 | Program: not specified |
Capillary | DB-5 | 1965. | Soderstrom, White, et al., 2001 | Program: not specified |
Capillary | DB-5 | 1970. | Soderstrom, White, et al., 2001 | Program: not specified |
Capillary | DB-5 | 1975. | Soderstrom, White, et al., 2001 | Program: not specified |
Capillary | DB-5 | 1986. | Soderstrom, White, et al., 2001 | Program: not specified |
Capillary | DB-5 | 1986. | Soderstrom, White, et al., 2001 | Program: not specified |
Capillary | DB-5 | 1969. | Kawata, Mukai, et al., 1996 | 30. m/0.25 mm/0.25 μm; Program: 50 0C (1 min) 20 0C/min -> 200 0C 10 0C/min -> 280 0C (2 min) |
Capillary | Ultra-1 | 1913. | Tameo and Kiyos, 1991 | Program: not specified |
Capillary | OV-1, SE-30, Methyl silicone, SP-2100, OV-101, DB-1, etc. | 1917. | Waggott and Davies, 1984 | Hydrogen; Column length: 50. m; Column diameter: 0.32 mm; Program: not specified |
Other | Methyl Silicone | 1917. | Ardrey and Moffat, 1981 | Program: not specified |

Normal alkane RI, polar column, custom temperature program

Column type | Active phase | I | Reference | Comment |
---|---|---|---|---|
Capillary | Carbowax 20M | 2872. | Tameo and Kiyos, 1991 | Program: not specified |

References

Witschonke, 1954
Witschonke, C.R.,
Freezing point and purity data for some organic compounds,
Anal. Chem., 1954, 26, 562-4. [all data]
Stephenson and Malanowski, 1987
Stephenson, Richard M.; Malanowski, Stanislaw,
Handbook of the Thermodynamics of Organic Compounds, 1987, https://doi.org/10.1007/978-94-009-3173-2
. [all data]