Benzenesulfonic acid, 4-amino-
- Formula: C6H7NO3S
- Molecular weight: 173.190
- IUPAC Standard InChIKey: HVBSAKJJOYLTQU-UHFFFAOYSA-N
- CAS Registry Number: 121-57-3
- Chemical structure:
View 3d structure (requires JavaScript / HTML 5) - Other names: Sulfanilic acid; p-Aminobenzenesulfonic acid; Aniline-p-sulfonic acid; Aniline-4-sulfonic acid; 4-Aminobenzenesulfonic acid; 4-Amino benzenesulphonic acid; Sulphanilic acid; Aniline-p-sulphonic acid; p-Aminophenylsulfonic acid; Kyselina sulfanilova; Sulfanilsaeure; p-Anilinesulfonic acid; NSC 7170

Condensed phase thermochemistry data

Data compiled by: Hussein Y. Afeefy, Joel F. Liebman, and Stephen E. Stein
Quantity | Value | Units | Method | Reference | Comment |
---|---|---|---|---|---|
ΔfH°solid | -146.3 ± 0.24 | kcal/mol | Ccr | Yang, Pilcher, et al., 1994 | H2SO4(1:115) |
Quantity | Value | Units | Method | Reference | Comment |
ΔcH°solid | -801.0 ± 0.1 | kcal/mol | Ccr | Yang, Pilcher, et al., 1994 | H2SO4(1:115) |

References

Yang, Pilcher, et al., 1994
Yang, M.-Y.; Pilcher, G.; Macnab, J.I.,
Standard enthalpies of formation in the crystalline state of aminomethanesulfonic acid, 2-aminoethanesulfonic acid, and the three aminobenzenesulfonic acids,
J. Chem. Thermodyn., 1994, 26, 787-790. [all data]