Benzenamine, 2-chloro-5-(trifluoromethyl)-
- Formula: C7H5ClF3N
- Molecular weight: 195.570
- IUPAC Standard InChIKey: VKTTYIXIDXWHKW-UHFFFAOYSA-N
- CAS Registry Number: 121-50-6
- Chemical structure:
View 3d structure (requires JavaScript / HTML 5) - Other names: m-Toluidine, 6-chloro-α,α,α-trifluoro-; Azoene Fast Orange RD Salt; C.I. 37050; Daito Orange Salt RD; Diazo Fast Orange RD; Fast Orange RD Oil; Fast Orange RD Salt; Fast Orange Salt RDA; Fast Orange Salt RDN; Hiltosal Fast Orange RD Salt; Orange Salt NRD; Sanyo Fast Orange Salt RD; 2-Chloro-5-(trifluoromethyl)aniline; 3-Amino-4-chlorobenzotrifluoride; 4-Chloro-3-aminobenzotrifluoride; 6-Chloro-α,α,α-trifluoro-m-toluidine; Fast Orange Salt RD; USAF MA-13; 3-Amino-4-chloro-α,α,α-trifluorotoluene; 6-Chloro-3-(trifluoromethyl)aniline; NSC 10318

Phase change data

Data compiled by: Robert L. Brown and Stephen E. Stein
Reduced pressure boiling point
Tboil (K) | Pressure (bar) | Reference |
---|---|---|
355. to 356. | 0.01 | PCR Inc., 1990 |
355. to 356. | 0.01 | Frinton Laboratories Inc., 1986 |

References

PCR Inc., 1990
PCR Inc.,
Research Chemicals Catalog 1990-1991, PCR Inc., Gainesville, FL, 1990, 1. [all data]
Frinton Laboratories Inc., 1986
Frinton Laboratories Inc.,
Catalog Number 11, Frinton Laboratories Inc., Vineland, NJ, 1986, 99. [all data]