Bis(mesitylene)chromium iodide

Phase change data

Data compiled by: Eugene S. Domalski and Elizabeth D. Hearing

Enthalpy of phase transition

ΔHtrs (kJ/mol) Temperature (K) Initial Phase Final Phase Reference Comment
0.105260.crystaline, IIcrystaline, INikolaev, Safonov, et al., 1972

Entropy of phase transition

ΔStrs (J/mol*K) Temperature (K) Initial Phase Final Phase Reference Comment
0.40260.crystaline, IIcrystaline, INikolaev, Safonov, et al., 1972

References

Nikolaev, Safonov, et al., 1972
Nikolaev, P.N.; Safonov, V.A.; Moseeva, E.M.; Rabinovich, I.B., Specific heat and solid-state transitions of bis(arene)chromium halides, Tr. Khim. Khim. Tekhnol., 1972, (2), 54-60. [all data]