E-1-Methoxy-3-hexene
- Formula: C7H14O
- Molecular weight: 114.1855
- IUPAC Standard InChIKey: KUPODEXLSGEWFR-SNAWJCMRSA-N
- CAS Registry Number: 121441-40-5
- Chemical structure:
View 3d structure (requires JavaScript / HTML 5) - Stereoisomers:
- Other names: (3E)-1-Methoxy-3-hexene; (E)-3-Hexenyl methyl ether; trans-1-Methoxy-3-hexene

Van Den Dool and Kratz RI, non-polar column, temperature ramp

Column type | Active phase | I | Reference | Comment |
---|---|---|---|---|
Capillary | CP Sil 5 CB | 810. | Pino, Marbot, et al., 2002 | 50. m/0.32 mm/0.4 μm, He, 60. C @ 10. min, 3. K/min, 280. C @ 60. min |

Van Den Dool and Kratz RI, polar column, temperature ramp

Column type | Active phase | I | Reference | Comment |
---|---|---|---|---|
Capillary | AT-Wax | 974. | Pino, Marbot, et al., 2002 | 60. m/0.32 mm/0.25 μm, He, 65. C @ 10. min, 2. K/min, 250. C @ 60. min |

References

Pino, Marbot, et al., 2002
Pino, J.A.; Marbot, R.; Vázquez, C.,
Characterization of volatile in Cosa Rican Guava [Psidium friedrichsthalianum (Berg) Niedenzu] fruit,
J. Agric. Food Chem., 2002, 50, 21, 6023-6026, https://doi.org/10.1021/jf011456i
. [all data]