Titanium oxide

Condensed phase thermochemistry data

Quantity Value Units Method Reference Comment
Δfliquid-3216.04kJ/molReviewChase, 1998Data last reviewed in December, 1973
Quantity Value Units Method Reference Comment
liquid,1 bar290.95J/mol*KReviewChase, 1998Data last reviewed in December, 1973
Quantity Value Units Method Reference Comment
Δfsolid-3404.53kJ/molReviewChase, 1998Data last reviewed in December, 1973
Quantity Value Units Method Reference Comment
solid198.34J/mol*KReviewChase, 1998Data last reviewed in December, 1973

Liquid Phase Heat Capacity (Shomate Equation)

Cp° = A + B*t + C*t2 + D*t3 + E/t2
H° − H°298.15= A*t + B*t2/2 + C*t3/3 + D*t4/4 − E/t + F − H
S° = A*ln(t) + B*t + C*t2/2 + D*t3/3 − E/(2*t2) + G
    Cp = heat capacity (J/mol*K)
    H° = standard enthalpy (kJ/mol)
    S° = standard entropy (J/mol*K)
    t = temperature (K) / 1000.

View plot Requires a JavaScript / HTML 5 canvas capable browser.

View table.

Temperature (K) 1950. - 4000.
A 368.1924
B 2.253879×10-7
C -6.933266×10-8
D 7.249157×10-9
E 1.209812×10-7
F -3416.324
G 588.1825
H -3216.040
ReferenceChase, 1998
Comment Data last reviewed in December, 1973

Solid Phase Heat Capacity (Shomate Equation)

Cp° = A + B*t + C*t2 + D*t3 + E/t2
H° − H°298.15= A*t + B*t2/2 + C*t3/3 + D*t4/4 − E/t + F − H
S° = A*ln(t) + B*t + C*t2/2 + D*t3/3 − E/(2*t2) + G
    Cp = heat capacity (J/mol*K)
    H° = standard enthalpy (kJ/mol)
    S° = standard entropy (J/mol*K)
    t = temperature (K) / 1000.

View plot Requires a JavaScript / HTML 5 canvas capable browser.

View table.

Temperature (K) 298. - 1950.
A 248.9442
B 81.06458
C -36.39967
D 6.641765
E -5.509993
F -3500.652
G 446.0018
H -3404.525
ReferenceChase, 1998
Comment Data last reviewed in December, 1973

References

Chase, 1998
Chase, M.W., Jr., NIST-JANAF Themochemical Tables, Fourth Edition, J. Phys. Chem. Ref. Data, Monograph 9, 1998, 1-1951. [all data]