S2O radical anion
- Formula: OS2-
- Molecular weight: 80.130
- CAS Registry Number: 12143-07-6

Reaction thermochemistry data

Data compiled by: John E. Bartmess
Individual Reactions
By formula: (OS2- • 4294967295S2) + S2 = OS2-
Quantity | Value | Units | Method | Reference | Comment |
---|---|---|---|---|---|
ΔrH° | 474.0 ± 1.6 | kJ/mol | N/A | Nimlos and Ellison, 1986 | gas phase |

Ion clustering data

Data compiled by: John E. Bartmess
Clustering reactions
By formula: (OS2- • 4294967295S2) + S2 = OS2-
Quantity | Value | Units | Method | Reference | Comment |
---|---|---|---|---|---|
ΔrH° | 474.0 ± 1.6 | kJ/mol | N/A | Nimlos and Ellison, 1986 | gas phase |

References

Nimlos and Ellison, 1986
Nimlos, M.R.; Ellison, G.B.,
Photoelectron spectroscopy of SO2-, S3-, and S2O-,
J. Phys. Chem., 1986, 90, 2574. [all data]